{"text_format":"1","workbook":"xlsx","n_sheets":6,"sheets":["capa","cadastro","calculo","sobre","tabelas","rascunho"],"not_rendered":{"charts":0,"images":16,"macros":1,"external_links":0,"defined_names":97,"comments":0,"pivot_tables":0},"unopened":[],"bounds":{"document_bytes":16777216,"sheet_cells":100000,"rows_first":2000,"rows_last":500,"rows_between":2000,"halvings":0,"cell_chars":16384,"cell_head_chars":4096},"cells_cut":0,"cells_raw":0,"read":"whole","date_system":"1900"}

{"sheet":"capa","index":0,"n_rows":25,"n_cols":2,"rows_kept":25,"cut":false,"hidden":false,"merged":[]}
[]
[]
[]
[]
[]
[]
[]
[]
[]
[]
{"$rows_left_out":16}
{"sheet":"cadastro","index":1,"n_rows":53,"n_cols":26,"rows_kept":53,"cut":false,"hidden":false,"merged":[[52,17,52,21],[31,21,31,25],[53,17,56,21],[3,1,3,2],[4,1,4,2],[49,17,49,18],[3,7,4,7],[3,10,4,10],[3,11,4,11],[6,1,6,2],[3,8,4,8],[3,12,4,12],[3,13,4,13],[3,14,4,14],[2,1,2,5],[4,21,6,25],[50,17,50,18],[5,1,5,2],[50,20,50,21],[5,4,5,5],[3,3,3,5],[4,3,4,5],[49,19,49,21],[6,3,6,5],[2,7,2,8]]}
[]
[]
[null,"CADASTRO",null,null,null,null,null,"PSS S/ RUBRICA"]
[null,"NÚMERO DO PROCESSO:",null,null,null,null,null,"DATA","VALOR",null,"TIPO DE\nPARCELA","HISTÓRICO","VALOR DO JUROS","FOLHAS","CRITICA"]
[null,"NOME DO AUTOR:",null,null,null,null,null,null,null,null,null,null,null,null,null,"TIP",null,null,null,null,null,"CORREÇÃO MONETÁRIA"]
[null,"DATA FINAL DE ATUALIZAÇÃO:",null,{"$f":"+VHOJE","v":"2021-12-01"},{"$f":"+IF(S13>VDAT_AT,CONCATENATE(\"Data ajustada para \",TEXT(EOMONTH(VDAT_IND,0),\"dd/mm/aaaa\")),\"\")","v":""},null,null,null,null,null,"POSITIVA","CONTR. PSS",null,null,{"$f":"+IF(AND(H6<=DAT_VAL,H6>=DAT_LIM_AT,K6<>\"\",H6<>\"\",OR(I6<>\"\",M6<>\"\")),\"OK\",\"\")","v":""},{"$f":"+IF(O6=\"\",\"\",IF(LEFT(K6,1)=\"P\",\"C\",\"D\"))","v":""}]
[null,"CRITÉRIO DOS JUROS DE MORA:",null,"SELIC",null,null,null,null,null,null,"POSITIVA","CONTR. PSS",null,null,"",""]
[null,null,null,null,null,null,null,null,null,null,"POSITIVA","CONTR. PSS",null,null,"","",null,"COR. MONETÁRIA (ref):",{"$f":"+IF(T50=\"\",0,LOOKUP(MATCH(T50,tabelas!BD9:BD26,0),tabelas!BB:BB,tabelas!BC:BC))","v":0},"COD_CM",null,"nr","CRITÉRIO","NR","ORD","CRITÉRIO"]
[null,null,null,null,null,null,null,null,null,null,"POSITIVA","CONTR. PSS",null,null,"","",null,"PROCESSO",{"$f":"+IF(cadastro!D4=\"\",\"\",cadastro!D4)","v":""},"NUM_PROC1"]
[null,null,null,null,null,null,null,null,null,null,"POSITIVA","CONTR. PSS",null,null,"","",null,"AUTOR",{"$f":"+IF(cadastro!D5=\"\",\"\",cadastro!D5)","v":""},null,null,1,{"$f":"+IF(tabelas!BD9=\"\",\"\",tabelas!BD9)","v":"Resolução CJF - 267/2013"},{"$f":"+IF(W10=\"\",\"\",V10)","v":1},{"$f":"+IF(ISERR(SMALL($X$10:$X$27,V10)),\"\",SMALL($X$10:$X$27,V10))","v":1},{"$f":"+IF(Y10=\"\",\"\",LOOKUP(Y10,$V$10:$V$27,$W$10:$W$27))","v":"Resolução CJF - 267/2013"}]
{"$rows_left_out":44}
{"sheet":"calculo","index":2,"n_rows":65,"n_cols":16,"rows_kept":65,"cut":false,"hidden":false,"merged":[[2,1,2,11],[3,1,3,11],[4,1,4,11],[5,1,5,11],[7,1,7,3],[6,1,6,11],[7,4,7,10],[14,14,14,15],[11,11,12,11],[54,1,55,10],[47,1,48,4],[11,1,11,5],[11,9,11,10],[11,7,11,8],[8,1,8,3],[11,6,12,6],[47,5,48,11],[8,4,8,10],[58,1,60,10],[41,1,42,4],[43,1,44,4],[45,1,46,4],[52,1,53,10],[41,6,42,10],[43,6,44,10],[45,6,46,10]]}
[]
[]
[null,"PODER JUDICIÁRIO"]
[null,"JUSTIÇA FEDERAL"]
[null,"Seção Judiciária do Rio de Janeiro"]
[null,"CÁLCULO DE ATUALIZAÇÃO"]
[]
[null,"PROCESSO:",null,null,"AUTOR(A) :",null,null,null,null,null,null,"ATUALIZADO ATÉ:"]
[null,{"$f":"+IF(cadastro!D4=\"\",\"\",cadastro!D4)","v":""},null,null,{"$f":"+IF(cadastro!D5=\"\",\"\",PROPER(cadastro!D5))","v":""},null,null,null,null,null,null,{"$f":"+IF(VDAT_AT=\"\",\"\",VDAT_AT)","v":"2021-12-01"}]
[null,"CÁLCULO"]
{"$rows_left_out":56}
{"sheet":"sobre","index":3,"n_rows":74,"n_cols":12,"rows_kept":74,"cut":false,"hidden":false,"merged":[[0,0,0,9],[26,1,26,3],[6,1,6,2],[8,1,8,2],[9,1,9,2],[2,1,2,2],[3,1,3,2],[4,1,4,2],[5,1,5,2]]}
[]
[]
[null,"PODER JUDICIÁRIO",null,null,null,"SIGLA:","PAV"]
[null,"JUSTIÇA FEDERAL",null,null,null,"DATA:","2018-11-08"]
[null,"Seção Judiciária do Rio de Janeiro",null,null,null,"VERSÃO:",2]
[null,"SUBSECRETÁRIA DE CÁLCULO JUDICIAL",null,null,null,"REVISÃO:",2]
[null,"AUTOMAÇÃO DE FERRAMENTAS PARA CÁLCULO JUDICIAL",null,null,null,"MÊS:",{"$f":"+MONTH(DAT_PLAN)","v":11}]
[null,null,null,null,null,"ANO INICIAL:",2016]
[null,{"$f":"+NOM_PLAN","v":"CÁLCULO DE ATUALIZAÇÃO DE PSS SOBRE RUBRICA"},null,null,null,"ANO FINAL:",2019]
[null,{"$f":"+NOM_VER","v":"VERSÃO: 2.2.11.2016-2019"},{"$f":"+NOM_VER","v":"VERSÃO: 2.2.11.2016-2019"},null,null,"VERSÂO:",{"$f":"+CONCATENATE(F5,\" \",TEXT(G5,\"#0\"),\".\",TEXT(G6,\"#0\"),\".\",TEXT(G7,\"#0\"),\".\",TEXT(G8,\"#0\"),\"-\",TEXT(G9,\"#0\"))","v":"VERSÃO: 2.2.11.2016-2019"}]
{"$rows_left_out":65}
{"sheet":"tabelas","index":4,"n_rows":400,"n_cols":106,"rows_kept":400,"cut":false,"hidden":true,"merged":[[28,59,28,60],[5,40,5,44],[6,40,6,44],[5,46,5,51],[6,47,6,49],[6,50,7,50],[6,51,7,51],[6,46,7,46],[5,26,5,35],[6,26,6,30],[6,31,6,35],[5,37,5,38],[6,37,6,38],[5,16,5,19],[6,16,6,17],[6,18,6,19],[5,21,5,24],[6,21,6,22],[6,23,6,24],[5,1,5,4],[5,6,5,9],[5,11,5,14],[6,6,6,7],[6,8,6,9],[6,1,6,2],[6,3,6,4],[6,11,6,12],[6,13,6,14],[1,74,1,78],[5,95,7,95],[7,98,7,99],[8,69,67,70],[6,80,7,80],[6,82,7,82],[5,94,7,94],[6,81,7,81],[6,74,6,75],[6,76,6,78],[6,87,7,87],[6,85,7,85],[6,89,6,92],[6,83,7,83],[6,84,7,84],[5,74,5,78],[5,80,5,87],[5,64,7,64],[5,65,7,65],[326,104,326,105],[6,86,7,86],[6,69,6,70],[6,71,6,72],[5,69,5,72],[5,101,5,102],[6,101,6,102],[5,104,5,105],[6,104,6,105]]}
["CORREÇÃO MONETÁRIA (VERIFICADO EM 7/11/2018)"]
[null,null,null,null,null,null,null,null,null,null,null,null,null,null,null,null,null,null,null,null,null,null,null,null,null,null,null,null,null,null,null,null,null,null,null,null,null,"MÊS INICIAL",{"$f":"+AL9","v":"2001-01-01"},null,null,null,null,null,null,null,null,null,null,null,null,null,null,null,null,null,null,null,null,null,null,null,null,null,null,null,null,null,null,null,null,null,null,null,"ok - 4/5/2017"]
[null,"MÊS INICIAL",{"$f":"+M_SM","v":"2000-01-01"},null,null,null,"MÊS INICIAL",{"$f":"+M_IPCAE","v":"2001-01-01"},null,null,null,"MÊS INICIAL",{"$f":"+M_IPCA","v":"2001-01-01"},null,null,null,"MÊS INICIAL",{"$f":"+M_TR","v":"2001-01-01"},null,null,null,"MÊS INICIAL",{"$f":"+M_INPC","v":"2006-09-01"},null,null,null,"MÊS INICIAL",{"$f":"+AF9","v":"1996-01-01"},null,null,null,null,null,null,null,null,null,"MÊS FINAL",{"$f":"+IF(ISERR(LARGE(AL:AL,1)),\"\",LARGE(AL:AL,1))","v":"2021-04-01"},null,"MÊS INICIAL",{"$f":"AO9","v":"2001-01-01"},null,null,null,null,null,null,null,null,null,null,null,null,null,null,null,null,null,null,null,null,null,null,null,null,null,null,null,"MÊS REF:",{"$f":"+EOMONTH(TRUNC(NOW(),0),-1)+1","v":"2021-12-01"},null,null,null,"MÊS REF",{"$f":"+EOMONTH(TRUNC(NOW(),0),-1)+1","v":"2021-12-01"}]
[null,"MÊS FINAL",{"$f":"+IF(ISERR(LARGE(D:D,1)),\"\",LARGE(D:D,1))","v":"2021-12-01"},null,null,null,"MÊS FINAL",{"$f":"+IF(ISERR(LARGE(I:I,1)),\"\",LARGE(I:I,1))","v":"2021-04-01"},null,null,null,"MÊS FINAL",{"$f":"+IF(ISERR(LARGE(N:N,1)),\"\",LARGE(N:N,1))","v":"2021-04-01"},null,null,null,"MÊS FINAL",{"$f":"+IF(ISERR(LARGE(S:S,1)),\"\",LARGE(S:S,1))","v":"2021-04-01"},null,null,null,"MÊS FINAL",{"$f":"+IF(ISERR(LARGE(X:X,1)),\"\",LARGE(X:X,1))","v":"2021-03-01"},null,null,null,"MÊS FINAL",{"$f":"+IF(ISERR(LARGE(AF:AF,1)),\"\",LARGE(AF:AF,1))","v":"2021-04-01"},null,null,null,null,null,null,null,null,null,"ATUALIZA:",{"$f":"+IF(AM3=\"\",\"S\",IF(AM3<AM2,\"S\",\"N\"))","v":"N"},null,"MÊS FINAL",{"$f":"+IF(ISERR(LARGE(AO:AO,1)),\"\",LARGE(AO:AO,1))","v":"2021-12-01"},null,null,null,null,null,null,null,null,null,null,null,null,null,null,null,null,null,null,null,null,null,null,null,null,null,null,null,"MÊS TABELA:",{"$f":"+IF(ISERR(LARGE(BT:BT,1)),\"\",LARGE(BT:BT,1))","v":"2021-04-01"},null,null,null,"MÊS TABELA:",{"$f":"+IF(ISERR(LARGE(BY:BY,1)),\"\",LARGE(BY:BY,1))","v":"2021-04-01"}]
[null,"ATUALIZA:",{"$f":"+IF(C4=\"\",\"S\",IF(C4<VMES99,\"S\",\"N\"))","v":"N"},{"$f":"COLUMN(D5)","v":4},{"$f":"COLUMN(E5)","v":5},null,"ATUALIZA:",{"$f":"+IF(H4=\"\",\"S\",IF(H4<VMES99,\"S\",\"N\"))","v":"S"},{"$f":"COLUMN(I5)","v":9},{"$f":"COLUMN(J5)","v":10},null,"ATUALIZA:",{"$f":"+IF(M4=\"\",\"S\",IF(M4<VMES99,\"S\",\"N\"))","v":"S"},{"$f":"COLUMN(N5)","v":14},{"$f":"COLUMN(O5)","v":15},null,"ATUALIZA:",{"$f":"+IF(R4=\"\",\"S\",IF(R4<VMES99,\"S\",\"N\"))","v":"S"},{"$f":"COLUMN(S5)","v":19},{"$f":"COLUMN(T5)","v":20},null,"ATUALIZA:",{"$f":"+IF(W4=\"\",\"S\",IF(W4<VMES99,\"S\",\"N\"))","v":"S"},{"$f":"COLUMN(X5)","v":24},{"$f":"COLUMN(Y5)","v":25},null,"ATUALIZA:",{"$f":"+IF(AB4=\"\",\"S\",IF(AB4<VMES99,\"S\",\"N\"))","v":"S"},null,null,null,{"$f":"COLUMN(AF5)","v":32},{"$f":"COLUMN(AG5)","v":33},{"$f":"COLUMN(AH5)","v":34},{"$f":"COLUMN(AI5)","v":35},{"$f":"COLUMN(AJ5)","v":36},null,{"$f":"COLUMN(AL5)","v":38},{"$f":"COLUMN(AM5)","v":39},null,{"$f":"COLUMN(AO5)","v":41},{"$f":"COLUMN(AP5)","v":42},{"$f":"COLUMN(AQ5)","v":43},44,45,null,null,null,null,null,null,null,null,null,null,null,null,null,null,null,null,null,null,null,null,null,null,null,null,"ATUALIZA:",{"$f":"+IF(BS4=\"\",\"S\",IF(BS4<BS3,\"S\",\"N\"))","v":"S"},null,null,null,"ATUALIZA:",{"$f":"+IF(BX4=\"\",\"S\",IF(BX4<BX3,\"S\",\"N\"))","v":"S"}]
[null,"SALÁRIO MÍNIMO",null,null,null,null,"Res CJF - 267/2013 (IPCA-E)",null,null,null,null,"IPCA",null,null,null,null,"TR",null,null,null,null,"INPC",null,null,null,null,"FGTS (VERIFICAR)",null,null,null,null,null,null,null,null,null,null,"Res CJF - 134/2010",null,null,"JUROS REMUNERATÓRIO - FGTS",null,null,null,null,null,"CORREÇÃO MONETÁRIA",null,null,null,null,null,null,null,null,null,null,null,null,null,null,null,null,null,"VCOL_NR","VCOL_LT",null,null,null,"RENTABILIDADE - POUPANÇA",null,null,null,null,"SELIC",null,null,null,null,null,"JUROS DE MORA",null,null,null,null,null,null,null,null,null,null,null,null,null,"COL_DAT_CORTE","COL_VAL_CORTE",null,null,{"$f":"+COUNTA(CU9:CU208)","v":5},"NTOT",null,"MODULAÇÃO FUX",null,null,"TR+RENTAB"]
[null,"IMPORTADO",null,"PROCESSADO",null,null,"IMPORTADO",null,"PROCESSADO",null,null,"IMPORTADO",null,"PROCESSADO",null,null,"IMPORTADO",null,"PROCESSADO",null,null,"IMPORTADO",null,"PROCESSADO",null,null,"IMPORTADO",null,null,null,null,"PROCESSADO",null,null,null,null,null,"PROCESSADO",null,null,"PROCESSADO",null,null,null,null,null,"linha","SELEÇÃO DE ÍNDICE",null,null,"COEFICIENTE\nACUMULADO","CORTE",null,null,null,null,null,null,null,null,null,null,null,null,null,null,null,null,null,"IMPORTADO",null,"PROCESSADO",null,null,"IMPORTADO",null,"PROCESSADO",null,null,null,"MÊS/tab","MÊS/calc","JUROS\n(1/4/11)","JUROS\n(2)","JUROS\n(3)","JUROS\n SELIC","JUROS\nSELECIO","ACUMULADO",null,"JUROS DE MORA - ok - 4/5/2017",null,null,null,null,null,null,null,null,{"$f":"+IF(ISNA(MATCH(SERIAL,CV9:CV300,0)),0,MATCH(SERIAL,CV9:CV300,0))","v":0},"NPROC",null,"PROCESSADO",null,null,"PROCESSADO"]
[null,"MÊS","VALOR","MÊS","VALOR",null,"MÊS","VALOR","MÊS","VALOR",null,"MÊS","VALOR","MÊS","VALOR",null,"CRÉDITO","VALOR","ínicio","VALOR",null,"MÊS","VALOR","MÊS","VALOR",null,"MÊS","3%","4%","5%","6%","MÊS","3%","4%","5%","6%",null,"MÊS","VALOR",null,"MÊS","3%","4%","5%","6%",null,null,"MÊS","MÊS","COTAÇÃO",null,null,null,"NR","COD","CRITÉRIO","LETRA",null,"lib","MINÍMO","MÁXIMO","INFOR","HISTÓRICO",null,null,null,null,null,null,"CRÉDITO","VALOR","CRÉDITO","VALOR",null,"MÊS","VALOR","MÊS","MÊS","VALOR",null,null,null,null,null,null,null,null,null,null,"Nr","CRITÉRIO","LIB","HISTÓRICO",null,null,null,null,null,"LISTA DE BLOQUEIO",null,null,"MÊS","VALOR",null,"MÊS","VALOR"]
[null,"2000-01-01",136,{"$f":"+IF(TRIM(B9)=\"\",\"\",B9)","v":"2000-01-01"},{"$f":"+IF(TRIM(C9)=\"\",\"\",C9)","v":136},null,"2001-01-01",6.3E-3,{"$f":"+IF(AND(TRIM(G9)=\"\",TRIM(G8)<>\"\"),EDATE(I8,1),IF(TRIM(G9)=\"\",\"\",TRUNC(G9,0)))","v":"2001-01-01"},{"$f":"+IF(AND(H9=\"\",H8<>\"\"),0,IF(TRIM(H9)=\"\",\"\",H9))","v":6.3E-3},null,"2001-01-01",5.7000000000000002E-3,{"$f":"+IF(TRIM(L9)=\"\",\"\",TRUNC(L9,0))","v":"2001-01-01"},{"$f":"+IF(TRIM(M9)=\"\",\"\",M9)","v":5.7000000000000002E-3},null,"2001-01-01",1.369E-3,{"$f":"+IF(AND(TRIM(Q9)=\"\",TRIM(Q8)<>\"\"),EDATE(S8,1),IF(TRIM(Q9)=\"\",\"\",TRUNC(Q9,0)))","v":"2001-01-01"},{"$f":"+IF(AND(R9=\"\",R8<>\"\"),0,IF(TRIM(R9)=\"\",\"\",R9))","v":1.369E-3},null,"2006-09-01",1.6000000000000001E-3,{"$f":"+IF(AND(TRIM(V9)=\"\",TRIM(V8)<>\"\"),EDATE(X8,1),IF(TRIM(V9)=\"\",\"\",TRUNC(V9,0)))","v":"2006-09-01"},{"$f":"+IF(AND(W9=\"\",W8<>\"\"),0,IF(TRIM(W9)=\"\",\"\",W9))","v":1.6000000000000001E-3},null,null,null,null,null,null,"1996-01-01",1.5023E-2,1.584E-2,1.6650999999999999E-2,1.7454000000000001E-2,null,{"$f":"+I9","v":"2001-01-01"},{"$f":"+J9","v":6.3E-3},null,"2001-01-01",2.4659999999999999E-3,3.2729999999999999E-3,4.0740000000000004E-3,4.8669999999999998E-3,null,9,{"$f":"IF(INDIRECT(CONCATENATE(VLET_DT,TEXT(AU9,\"#0\")))=\"\",\"\",INDIRECT(CONCATENATE(VLET_DT,TEXT(AU9,\"#0\"))))","v":{"$error":"#REF!"}},{"$f":"+IF(AV9=\"\",\"\",IF(AV9<=VDAT_AT,AV9,\"\"))","v":{"$error":"#REF!"}},{"$f":"IF(OR(AW9=\"\",INDIRECT(CONCATENATE(VLET_COT,TEXT(AU9,\"#0\")))=\"\"),\"\",IF(AW9=VDAT_AT,1+IF(COD_CM=4,0.01,0),INDIRECT(CONCATENATE(VLET_COT,TEXT(AU9,\"#0\")))))","v":{"$error":"#REF!"}},{"$f":"+IF(COD_CM=4,IF(AX9=\"\",\"\",AX9+IF(AY10=\"\",0,AY10)),IF(OR(AV9>VDAT_AT,AV9=\"\"),\"\",IF(AV9=VDAT_AT,1,IF(AY10=\"\",1,AY10)*(1+AX9)/AZ9)))","v":{"$error":"#REF!"}},{"$f":"+IF(AW9=\"\",\"\",LOOKUP(AW9,COL_DAT_CORTE,COL_VAL_CORTE))","v":{"$error":"#REF!"}},null,1,1,{"$f":"+IF(BG9=\"N\",\"\",\"Resolução CJF - 267/2013\")","v":"Resolução CJF - 267/2013"},{"$f":"+LOOKUP(I5,VCOL_NR,VCOL_LET)","v":"I"},{"$f":"+LOOKUP(J5,VCOL_NR,VCOL_LET)","v":"J"},"s",{"$f":"+H3","v":"2001-01-01"},{"$f":"+H4","v":"2021-04-01"},{"$f":"+IF(BG9=\"N\",\"\",CONCATENATE(\"- \",BD9,\" (índices cadastrados de \",TEXT(EDATE(BH9,0),\"MMM-AAAA\"),\" até \",TEXT(EDATE(BI9,0),\"MMM-AAAA\"),\")\"))","v":"- Resolução CJF - 267/2013 (índices cadastrados de jan-2001 até abr-2021)"},"Resolução CJF - 267/2013 - Correção monetária pelo IPCA-E",null,1,"A",null,null,null,null,null,"1996-01-01",5.0000000000000001E-3,null,"1996-01-01",2.58E-2,{"$f":"+IF(AND(TRIM(BW9)=\"\",TRIM(BW8)<>\"\"),EDATE(BY8,1),IF(TRIM(BW9)=\"\",\"\",TRUNC(BW9,0)))","v":"1996-01-01"},{"$f":"+IF(BY9=\"\",\"\",IF(BY9<=VDAT_AT,BY9,\"\"))","v":"1996-01-01"},{"$f":"+IF(BY9>VDAT_AT,\"\",IF(AND(BZ9<>\"\",BZ10=\"\"),0.01,IF(TRIM(BX9)=\"\",\"\",BX9)))","v":2.58E-2},null,{"$f":"+IF(BT9=\"\",\"\",BT9)","v":"1996-01-01"},{"$f":"+IF(CC9=\"\",\"\",IF(CC9<=VDAT_AT1,CC9,\"\"))","v":"1996-01-01"},{"$f":"+IF(CC9=\"\",\"\",IF(COD_JUROS=1,0.5%,IF(COD_JUROS=4,1%,IF(COD_JUROS=11,0%,\"\"))))","v":""},{"$f":"+IF(OR(COD_JUROS<>2,CD9=\"\"),\"\",BU9)","v":""},{"$f":"+IF(OR(COD_JUROS<>3,CD9=\"\"),\"\",0.5%)","v":""},{"$f":"+IF(OR(COD_JUROS<>10,CD9=\"\"),\"\",CA9)","v":2.58E-2},{"$f":"+IF(CD9=\"\",\"\",SUM(CE9:CH9))","v":2.58E-2},{"$f":"+IF(CI9=\"\",\"\",IF(CD9=VDAT_AT1,0,CI10+IF(CJ10=\"\",0,CJ10)))","v":3.4172999999999991},null,1,"0,5%","S","0,5% ao mês.",null,"1950-01-01",1,null,"M_SERIAL","PCGD-05-05-10-2010-2016",{"$f":"+IF(CU9=\"\",\"\",TRIM(CU9))","v":"PCGD-05-05-10-2010-2016"},null,{"$f":"+I9","v":"2001-01-01"},{"$f":"+J9","v":6.3E-3},null,{"$f":"+S9","v":"2001-01-01"},{"$f":"+IF(OR(T9=\"\",BU69=\"\"),\"\",((1+T9)*(1+BU69)-1))","v":6.3758449999997691E-3}]
[null,"2000-02-01",136,{"$f":"+IF(TRIM(B10)=\"\",\"\",B10)","v":"2000-02-01"},136,null,"2001-02-01",5.0000000000000001E-3,"2001-02-01",5.0000000000000001E-3,null,"2001-02-01",4.5999999999999999E-3,"2001-02-01",{"$f":"+IF(TRIM(M10)=\"\",\"\",M10)","v":4.5999999999999999E-3},null,"2001-02-01",3.68E-4,"2001-02-01",3.68E-4,null,"2006-10-01",4.3E-3,"2006-10-01",4.3E-3,null,null,null,null,null,null,"1996-02-01",1.2115000000000001E-2,1.2930000000000001E-2,1.3738E-2,1.4539E-2,null,"2001-02-01",5.0000000000000001E-3,null,"2001-02-01",2.4659999999999999E-3,3.2729999999999999E-3,4.0740000000000004E-3,4.8669999999999998E-3,null,10,{"$error":"#REF!"},{"$error":"#REF!"},{"$error":"#REF!"},{"$error":"#REF!"},{"$error":"#REF!"},null,2,2,{"$f":"+IF(BG10=\"N\",\"\",\"Resolução CJF - 134/2010\")","v":"Resolução CJF - 134/2010"},{"$f":"+LOOKUP(AL5,VCOL_NR,VCOL_LET)","v":"AL"},{"$f":"+LOOKUP(AM5,VCOL_NR,VCOL_LET)","v":"AM"},"s",{"$f":"+AM2","v":"2001-01-01"},{"$f":"+AM3","v":"2021-04-01"},"- Resolução CJF - 134/2010 (índices cadastrados de jan-2001 até abr-2021)","Resolução CJF - 134/2010 - Correção monetária pelo IPCA-E até jun/2009 e após correção pela TR.",null,2,"B"," ",null,null,null,null,"1996-02-01",5.0000000000000001E-3,null,"1996-02-01",2.35E-2,"1996-02-01","1996-02-01",2.35E-2,null,"1996-02-01",{"$f":"+IF(CD9=\"\",\"\",IF(EDATE(CD9,1)<=VDAT_AT1,EDATE(CD9,1),\"\"))","v":"1996-02-01"},"","","",2.35E-2,{"$f":"+IF(CD10=\"\",\"\",SUM(CE10:CH10))","v":2.35E-2},3.3937999999999993,null,2,"0,5% até 6/2009 e após juros poup.","S","0,5% ao mês até JUN/2009 e após juros remuneratório da poupança.",null,"1986-02-01",1,null,null,"xPCGD-04-05-10-200-2016",{"$f":"+IF(CU10=\"\",\"\",TRIM(CU10))","v":"xPCGD-04-05-10-200-2016"},null,"2001-02-01",5.0000000000000001E-3,null,"2001-02-01",5.369839999999737E-3]
{"$rows_left_out":391}
{"sheet":"rascunho","index":5,"n_rows":29,"n_cols":29,"rows_kept":29,"cut":false,"hidden":true,"merged":[[5,25,5,27],[4,25,4,27],[1,1,1,7],[1,19,1,20],[1,21,1,22],[2,25,2,28],[3,25,3,27],[18,25,19,28],[16,25,17,28],[6,25,6,27],[9,25,9,28],[10,25,11,28],[14,25,15,28],[12,25,13,28],[7,25,7,27]]}
[]
[null,"BD",null,null,null,null,null,null,null,null,null,null,null,null,null,null,null,null,null,"ATUALIZADO",null,"JUROS"]
[null,"REF","TIPO","HISTÓRICO","DATA","PRINCIPAL","JUROS","FOLHAS",null,"ORD","COD",null,"DESCRIÇÃO","FOLHAS","DATA","DATA","PRINCIPAL","JUROS","COEF. AT.","PRINCIPAL","JUROS","%","VALOR","TOTAL",null,"RESUMO GERAL"]
[null,1,{"$f":"+IF(cadastro!O6<>\"OK\",\"\",cadastro!P6)","v":""},{"$f":"+IF(C4=\"\",\"\",IF(cadastro!L6<>\"\",cadastro!L6,IF(C4=\"C\",\"Parcela Positiva\",\"Parcela Negativa\")))","v":""},{"$f":"+IF(C4=\"\",\"\",TRUNC(cadastro!H6,0)+B4/1000)","v":""},{"$f":"+IF(C4=\"\",\"\",cadastro!I6*IF(C4=\"D\",-1,1))","v":""},{"$f":"+IF(C4=\"\",\"\",cadastro!M6*IF(C4=\"D\",-1,1))","v":""},{"$f":"+IF(C4=\"\",\"\",LOWER(cadastro!N6))","v":""},null,{"$f":"+IF(ISERR(SMALL(E:E,B4)),\"\",SMALL(E:E,B4))","v":""},{"$f":"+IF(J4=\"\",\"\",ROUND((J4-TRUNC(J4,0))*1000,0))","v":""},null,{"$f":"+IF(K4=\"\",\"\",(LOOKUP(K4,B:B,D:D)))","v":""},{"$f":"+IF(K4=\"\",\"\",LOOKUP(K4,B:B,H:H))","v":""},{"$f":"+IF(J4=\"\",\"\",TRUNC(J4,0))","v":""},{"$f":"+IF(O4=\"\",\"\",EOMONTH(O4,-1)+1)","v":""},{"$f":"+IF(K4=\"\",\"\",LOOKUP(K4,B:B,F:F))","v":""},{"$f":"+IF(K4=\"\",\"\",LOOKUP(K4,B:B,G:G))","v":""},{"$f":"IF(P4=\"\",\"\",IF(COD_CM=0,1,LOOKUP(IF(COD_CM=4,EDATE(P4,1),P4),tabelas!AW:AW,tabelas!AY:AY)))","v":""},{"$f":"+IF(K4=\"\",\"\",TRUNC(Q4*S4,2))","v":""},{"$f":"+IF(K4=\"\",\"\",TRUNC(R4*S4,2))","v":""},{"$f":"+IF(P4=\"\",\"\",LOOKUP(EDATE(MAXA(VDAT_JUR1,P4),0),tabelas!CD:CD,tabelas!CJ:CJ))","v":""},{"$f":"+IF(P4=\"\",\"\",TRUNC(T4*V4,2))","v":""},{"$f":"+IF(P4=\"\",\"\",U4+W4+T4)","v":""},null,"TOTAL DO PRINCIPAL:",null,null,{"$f":"+T29","v":0}]
[null,2,{"$f":"+IF(cadastro!O7<>\"OK\",\"\",cadastro!P7)","v":""},{"$f":"+IF(C5=\"\",\"\",IF(cadastro!L7<>\"\",cadastro!L7,IF(C5=\"C\",\"Parcela Positiva\",\"Parcela Negativa\")))","v":""},{"$f":"+IF(C5=\"\",\"\",TRUNC(cadastro!H7,0)+B5/1000)","v":""},{"$f":"+IF(C5=\"\",\"\",cadastro!I7*IF(C5=\"D\",-1,1))","v":""},{"$f":"+IF(C5=\"\",\"\",cadastro!M7*IF(C5=\"D\",-1,1))","v":""},{"$f":"+IF(C5=\"\",\"\",LOWER(cadastro!N7))","v":""},null,"",{"$f":"+IF(J5=\"\",\"\",ROUND((J5-TRUNC(J5,0))*1000,0))","v":""},null,"","",{"$f":"+IF(J5=\"\",\"\",TRUNC(J5,0))","v":""},{"$f":"+IF(O5=\"\",\"\",EOMONTH(O5,-1)+1)","v":""},"","",{"$f":"IF(P5=\"\",\"\",IF(COD_CM=0,1,LOOKUP(IF(COD_CM=4,EDATE(P5,1),P5),tabelas!AW:AW,tabelas!AY:AY)))","v":""},{"$f":"+IF(K5=\"\",\"\",TRUNC(Q5*S5,2))","v":""},"",{"$f":"+IF(P5=\"\",\"\",LOOKUP(EDATE(MAXA(VDAT_JUR1,P5),0),tabelas!CD:CD,tabelas!CJ:CJ))","v":""},"","",null,"TOTAL DO JUROS:",null,null,{"$f":"+U29+W29","v":0}]
[null,3,{"$f":"+IF(cadastro!O8<>\"OK\",\"\",cadastro!P8)","v":""},{"$f":"+IF(C6=\"\",\"\",IF(cadastro!L8<>\"\",cadastro!L8,IF(C6=\"C\",\"Parcela Positiva\",\"Parcela Negativa\")))","v":""},{"$f":"+IF(C6=\"\",\"\",TRUNC(cadastro!H8,0)+B6/1000)","v":""},{"$f":"+IF(C6=\"\",\"\",cadastro!I8*IF(C6=\"D\",-1,1))","v":""},{"$f":"+IF(C6=\"\",\"\",cadastro!M8*IF(C6=\"D\",-1,1))","v":""},{"$f":"+IF(C6=\"\",\"\",LOWER(cadastro!N8))","v":""},null,"","",null,"","","","","","",{"$f":"IF(P6=\"\",\"\",IF(COD_CM=0,1,LOOKUP(IF(COD_CM=4,EDATE(P6,1),P6),tabelas!AW:AW,tabelas!AY:AY)))","v":""},"","",{"$f":"+IF(P6=\"\",\"\",LOOKUP(EDATE(MAXA(VDAT_JUR1,P6),0),tabelas!CD:CD,tabelas!CJ:CJ))","v":""},"","",null,"DIFERENÇA APURADA:",null,null,{"$f":"+AC4+AC5","v":0}]
[null,4,{"$f":"+IF(cadastro!O9<>\"OK\",\"\",cadastro!P9)","v":""},{"$f":"+IF(C7=\"\",\"\",IF(cadastro!L9<>\"\",cadastro!L9,IF(C7=\"C\",\"Parcela Positiva\",\"Parcela Negativa\")))","v":""},{"$f":"+IF(C7=\"\",\"\",TRUNC(cadastro!H9,0)+B7/1000)","v":""},{"$f":"+IF(C7=\"\",\"\",cadastro!I9*IF(C7=\"D\",-1,1))","v":""},{"$f":"+IF(C7=\"\",\"\",cadastro!M9*IF(C7=\"D\",-1,1))","v":""},{"$f":"+IF(C7=\"\",\"\",LOWER(cadastro!N9))","v":""},null,"","",null,"","","","","","",{"$f":"IF(P7=\"\",\"\",IF(COD_CM=0,1,LOOKUP(IF(COD_CM=4,EDATE(P7,1),P7),tabelas!AW:AW,tabelas!AY:AY)))","v":""},"","",{"$f":"+IF(P7=\"\",\"\",LOOKUP(EDATE(MAXA(VDAT_JUR1,P7),0),tabelas!CD:CD,tabelas!CJ:CJ))","v":""},"","",null,"TOTAL DEVIDO:",null,null,{"$f":"+IF(AC6<0,0,AC6)","v":0}]
[null,5,{"$f":"+IF(cadastro!O10<>\"OK\",\"\",cadastro!P10)","v":""},{"$f":"+IF(C8=\"\",\"\",IF(cadastro!L10<>\"\",cadastro!L10,IF(C8=\"C\",\"Parcela Positiva\",\"Parcela Negativa\")))","v":""},{"$f":"+IF(C8=\"\",\"\",TRUNC(cadastro!H10,0)+B8/1000)","v":""},{"$f":"+IF(C8=\"\",\"\",cadastro!I10*IF(C8=\"D\",-1,1))","v":""},{"$f":"+IF(C8=\"\",\"\",cadastro!M10*IF(C8=\"D\",-1,1))","v":""},{"$f":"+IF(C8=\"\",\"\",LOWER(cadastro!N10))","v":""},null,"","",null,"","","","","","",{"$f":"IF(P8=\"\",\"\",IF(COD_CM=0,1,LOOKUP(IF(COD_CM=4,EDATE(P8,1),P8),tabelas!AW:AW,tabelas!AY:AY)))","v":""},"","",{"$f":"+IF(P8=\"\",\"\",LOOKUP(EDATE(MAXA(VDAT_JUR1,P8),0),tabelas!CD:CD,tabelas!CJ:CJ))","v":""},"","",null,"SIT_IMP",null,null,{"$f":"+IF(M4<>\"\",\"S\",\"\")","v":""}]
[null,6,{"$f":"+IF(cadastro!O11<>\"OK\",\"\",cadastro!P11)","v":""},{"$f":"+IF(C9=\"\",\"\",IF(cadastro!L11<>\"\",cadastro!L11,IF(C9=\"C\",\"Parcela Positiva\",\"Parcela Negativa\")))","v":""},{"$f":"+IF(C9=\"\",\"\",TRUNC(cadastro!H11,0)+B9/1000)","v":""},{"$f":"+IF(C9=\"\",\"\",cadastro!I11*IF(C9=\"D\",-1,1))","v":""},{"$f":"+IF(C9=\"\",\"\",cadastro!M11*IF(C9=\"D\",-1,1))","v":""},{"$f":"+IF(C9=\"\",\"\",LOWER(cadastro!N11))","v":""},null,"","",null,"","","","","","",{"$f":"IF(P9=\"\",\"\",IF(COD_CM=0,1,LOOKUP(IF(COD_CM=4,EDATE(P9,1),P9),tabelas!AW:AW,tabelas!AY:AY)))","v":""},"","",{"$f":"+IF(P9=\"\",\"\",LOOKUP(EDATE(MAXA(VDAT_JUR1,P9),0),tabelas!CD:CD,tabelas!CJ:CJ))","v":""},"",""]
[null,7,{"$f":"+IF(cadastro!O12<>\"OK\",\"\",cadastro!P12)","v":""},{"$f":"+IF(C10=\"\",\"\",IF(cadastro!L12<>\"\",cadastro!L12,IF(C10=\"C\",\"Parcela Positiva\",\"Parcela Negativa\")))","v":""},{"$f":"+IF(C10=\"\",\"\",TRUNC(cadastro!H12,0)+B10/1000)","v":""},{"$f":"+IF(C10=\"\",\"\",cadastro!I12*IF(C10=\"D\",-1,1))","v":""},{"$f":"+IF(C10=\"\",\"\",cadastro!M12*IF(C10=\"D\",-1,1))","v":""},{"$f":"+IF(C10=\"\",\"\",LOWER(cadastro!N12))","v":""},null,"","",null,"","","","","","",{"$f":"IF(P10=\"\",\"\",IF(COD_CM=0,1,LOOKUP(IF(COD_CM=4,EDATE(P10,1),P10),tabelas!AW:AW,tabelas!AY:AY)))","v":""},"","",{"$f":"+IF(P10=\"\",\"\",LOOKUP(EDATE(MAXA(VDAT_JUR1,P10),0),tabelas!CD:CD,tabelas!CJ:CJ))","v":""},"","",null,"MEMÓRIA DE CÁLCULO"]
{"$rows_left_out":19}