{"text_format":"1","workbook":"xlsx","n_sheets":6,"sheets":["capa","cadastro","calculo","sobre","tabelas","rascunho"],"not_rendered":{"charts":0,"images":16,"macros":1,"external_links":0,"defined_names":97,"comments":0,"pivot_tables":0},"unopened":[],"bounds":{"document_bytes":16777216,"sheet_cells":100000,"rows_first":2000,"rows_last":500,"rows_between":2000,"halvings":0,"cell_chars":16384,"cell_head_chars":4096},"cells_cut":0,"cells_raw":0,"read":"whole","date_system":"1900"}

{"sheet":"capa","index":0,"n_rows":25,"n_cols":2,"rows_kept":25,"cut":false,"hidden":false,"merged":[]}
[]
[]
[]
[]
[]
[]
[]
[]
[]
[]
[]
[]
[]
[]
[]
[]
[]
[]
[]
[]
[]
[]
[]
[]
[null,{"$f":"+IF(AND(NPROC<>0,NTOT>0),\"Esta planilha precisa ser atualizada!\",\"\")","v":""}]

{"sheet":"cadastro","index":1,"n_rows":53,"n_cols":26,"rows_kept":53,"cut":false,"hidden":false,"merged":[[52,17,52,21],[31,21,31,25],[53,17,56,21],[3,1,3,2],[4,1,4,2],[49,17,49,18],[3,7,4,7],[3,10,4,10],[3,11,4,11],[6,1,6,2],[3,8,4,8],[3,12,4,12],[3,13,4,13],[3,14,4,14],[2,1,2,5],[4,21,6,25],[50,17,50,18],[5,1,5,2],[50,20,50,21],[5,4,5,5],[3,3,3,5],[4,3,4,5],[49,19,49,21],[6,3,6,5],[2,7,2,8]]}
[]
[]
[null,"CADASTRO",null,null,null,null,null,"PSS S/ RUBRICA"]
[null,"NÚMERO DO PROCESSO:",null,null,null,null,null,"DATA","VALOR",null,"TIPO DE\nPARCELA","HISTÓRICO","VALOR DO JUROS","FOLHAS","CRITICA"]
[null,"NOME DO AUTOR:",null,null,null,null,null,null,null,null,null,null,null,null,null,"TIP",null,null,null,null,null,"CORREÇÃO MONETÁRIA"]
[null,"DATA FINAL DE ATUALIZAÇÃO:",null,{"$f":"+VHOJE","v":"2021-12-01"},{"$f":"+IF(S13>VDAT_AT,CONCATENATE(\"Data ajustada para \",TEXT(EOMONTH(VDAT_IND,0),\"dd/mm/aaaa\")),\"\")","v":""},null,null,null,null,null,"POSITIVA","CONTR. PSS",null,null,{"$f":"+IF(AND(H6<=DAT_VAL,H6>=DAT_LIM_AT,K6<>\"\",H6<>\"\",OR(I6<>\"\",M6<>\"\")),\"OK\",\"\")","v":""},{"$f":"+IF(O6=\"\",\"\",IF(LEFT(K6,1)=\"P\",\"C\",\"D\"))","v":""}]
[null,"CRITÉRIO DOS JUROS DE MORA:",null,"SELIC",null,null,null,null,null,null,"POSITIVA","CONTR. PSS",null,null,"",""]
[null,null,null,null,null,null,null,null,null,null,"POSITIVA","CONTR. PSS",null,null,"","",null,"COR. MONETÁRIA (ref):",{"$f":"+IF(T50=\"\",0,LOOKUP(MATCH(T50,tabelas!BD9:BD26,0),tabelas!BB:BB,tabelas!BC:BC))","v":0},"COD_CM",null,"nr","CRITÉRIO","NR","ORD","CRITÉRIO"]
[null,null,null,null,null,null,null,null,null,null,"POSITIVA","CONTR. PSS",null,null,"","",null,"PROCESSO",{"$f":"+IF(cadastro!D4=\"\",\"\",cadastro!D4)","v":""},"NUM_PROC1"]
[null,null,null,null,null,null,null,null,null,null,"POSITIVA","CONTR. PSS",null,null,"","",null,"AUTOR",{"$f":"+IF(cadastro!D5=\"\",\"\",cadastro!D5)","v":""},null,null,1,{"$f":"+IF(tabelas!BD9=\"\",\"\",tabelas!BD9)","v":"Resolução CJF - 267/2013"},{"$f":"+IF(W10=\"\",\"\",V10)","v":1},{"$f":"+IF(ISERR(SMALL($X$10:$X$27,V10)),\"\",SMALL($X$10:$X$27,V10))","v":1},{"$f":"+IF(Y10=\"\",\"\",LOOKUP(Y10,$V$10:$V$27,$W$10:$W$27))","v":"Resolução CJF - 267/2013"}]
[null,null,null,null,null,null,null,null,null,null,"POSITIVA","CONTR. PSS",null,null,"","",null,"DATA DE ATUALIZAÇÃO:",{"$f":"IF(VDAT_VAL>VDAT_IND,VDAT_IND,VDAT_VAL)","v":"2021-12-01"},"VDAT_AT",null,2,{"$f":"+IF(tabelas!BD10=\"\",\"\",tabelas!BD10)","v":"Resolução CJF - 134/2010"},{"$f":"+IF(W11=\"\",\"\",V11)","v":2},2,{"$f":"+IF(Y11=\"\",\"\",LOOKUP(Y11,$V$10:$V$27,$W$10:$W$27))","v":"Resolução CJF - 134/2010"}]
[null,null,null,null,null,null,null,null,null,null,"POSITIVA","CONTR. PSS",null,null,"","",null,"DATA DE ATUALIZAÇÃO:",{"$f":"+EOMONTH(VDAT_AT,-1)+1","v":"2021-12-01"},"VDAT_AT1",null,3,{"$f":"+IF(tabelas!BD11=\"\",\"\",tabelas!BD11)","v":"TR"},3,3,"TR"]
[null,null,null,null,null,null,null,null,null,null,"POSITIVA","CONTR. PSS",null,null,"","",null,"AUXILIAR",{"$f":"+IF(D6=\"\",VHOJE,EOMONTH(D6,-1)+1)","v":"2021-12-01"},null,null,4,{"$f":"+IF(tabelas!BD12=\"\",\"\",tabelas!BD12)","v":""},"",9,"FGTS-3%"]
[null,null,null,null,null,null,null,null,null,null,"POSITIVA","CONTR. PSS",null,null,"","",null,"DATA DE HOJE(1):",{"$f":"+EOMONTH(TRUNC(NOW(),0),-1)+1","v":"2021-12-01"},"VHOJE",null,5,{"$f":"+IF(tabelas!BD13=\"\",\"\",tabelas!BD13)","v":""},"",12,"FGTS-6%"]
[null,null,null,null,null,null,null,null,null,null,"POSITIVA","CONTR. PSS",null,null,"","",null,"DATA FIM DE ATUAL.(1):",{"$f":"+IF(D6=\"\",\"\",EOMONTH(D6,-1)+1)","v":"2021-12-01"},"VDAT_VAL",null,6,{"$f":"+IF(tabelas!BD14=\"\",\"\",tabelas!BD14)","v":""},"",13,"JUROS REM FGTS-3%"]
[null,null,null,null,null,null,null,null,null,null,"POSITIVA","CONTR. PSS",null,null,"","",null,"JUROS (ref):",{"$f":"+IF(D7=\"\",\"\",MATCH(D7,tabelas!CM9:CM19,0))","v":10},"COD_JUROS",null,7,{"$f":"+IF(tabelas!BD15=\"\",\"\",tabelas!BD15)","v":""},"",14,"JUROS REM FGTS-6%"]
[null,null,null,null,null,null,null,null,null,null,"POSITIVA","CONTR. PSS",null,null,"","",null,"DATA DE ÍNICIO DOS JUROS:",{"$f":"+IF(T51=\"\",\"\",DATE(YEAR(T51),MONTH(T51),1))","v":""},"DAT_INI_JUR",null,8,{"$f":"+IF(tabelas!BD16=\"\",\"\",tabelas!BD16)","v":""},"",15,"JUROS REM FGTS-5%"]
[null,null,null,null,null,null,null,null,null,null,"POSITIVA","CONTR. PSS",null,null,"","",null,"DATA INICIO DO INDICE:",{"$f":"+IF(COD_CM=0,S22,LOOKUP(COD_CM,tabelas!BB9:BB20,tabelas!BH9:BH20))","v":"2001-01-01"},"DAT_LIM_AT",null,9,{"$f":"+IF(tabelas!BD17=\"\",\"\",tabelas!BD17)","v":"FGTS-3%"},9,{"$f":"+IF(ISERR(SMALL($X$10:$X$27,V18)),\"\",SMALL($X$10:$X$27,V18))","v":16},{"$f":"+IF(Y18=\"\",\"\",LOOKUP(Y18,$V$10:$V$27,$W$10:$W$27))","v":"IPCA"}]
[null,null,null,null,null,null,null,null,null,null,"POSITIVA","CONTR. PSS",null,null,"","",null,"DATA FIM DO ÍNDICE:",{"$f":"+IF(COD_CM=0,NOW(),LOOKUP(MATCH(COD_CM,tabelas!BC9:BC20),tabelas!BB9:BB20,tabelas!BI9:BI20))","v":"2021-12-07T09:37:51.890"},"VDAT_IND",null,10,{"$f":"+IF(tabelas!BD18=\"\",\"\",tabelas!BD18)","v":""},"",21,"Sem correção monetária"]
[null,null,null,null,null,null,null,null,null,null,"POSITIVA","CONTR. PSS",null,null,"","",null,"DATA PARA VALIDAÇÃO:",{"$f":"+EOMONTH(VDAT_AT,0)","v":"2021-12-31"},"DAT_VAL",null,11,{"$f":"+IF(tabelas!BD19=\"\",\"\",tabelas!BD19)","v":""},"","",""]
[null,null,null,null,null,null,null,null,null,null,"POSITIVA","CONTR. PSS",null,null,"","",null,"DATA LIMITE DE JUROS:",{"$f":"+IF(COD_CM=0,S22,LOOKUP(MATCH(COD_CM,tabelas!BC9:BC20),tabelas!BB9:BB20,tabelas!BH9:BH20))","v":"2001-01-01"},"DAT_LIM_JR",null,12,{"$f":"+IF(tabelas!BD20=\"\",\"\",tabelas!BD20)","v":"FGTS-6%"},12,"",""]
[null,null,null,null,null,null,null,null,null,null,"POSITIVA","CONTR. PSS",null,null,"","",null,"AUXILIAR 1:","2001-01-01",null,null,13,{"$f":"+IF(tabelas!BD21=\"\",\"\",tabelas!BD21)","v":"JUROS REM FGTS-3%"},13,"",""]
[null,null,null,null,null,null,null,null,null,null,"POSITIVA","CONTR. PSS",null,null,"","",null,null,null,null,null,14,{"$f":"+IF(tabelas!BD22=\"\",\"\",tabelas!BD22)","v":"JUROS REM FGTS-6%"},14,"",""]
[null,null,null,null,null,null,null,null,null,null,"POSITIVA","CONTR. PSS",null,null,"","",null,"DATA DE ÍNICIO DOS JUROS:",{"$f":"+IF(T51=\"\",\"\",TRUNC(T51,0))","v":""},"VDAT_JUR",null,15,{"$f":"+IF(tabelas!BD23=\"\",\"\",tabelas!BD23)","v":"JUROS REM FGTS-5%"},15,"",""]
[null,null,null,null,null,null,null,null,null,null,"POSITIVA","CONTR. PSS",null,null,"","",null,"DATA DE ÍNICIO DOS JUROS:",{"$f":"+IF(VDAT_JUR=\"\",\"\",EOMONTH(VDAT_JUR,-1)+1)","v":""},"VDAT_JUR1",null,16,{"$f":"+IF(tabelas!BD24=\"\",\"\",tabelas!BD24)","v":"IPCA"},16,"",""]
[null,null,null,null,null,null,null,null,null,null,"POSITIVA","CONTR. PSS",null,null,"","",null,null,null,null,null,17,{"$f":"+IF(tabelas!BD25=\"\",\"\",tabelas!BD25)","v":""},"","",""]
[null,null,null,null,null,null,null,null,null,null,"POSITIVA","CONTR. PSS",null,null,"","",null,null,null,null,null,21,{"$f":"+IF(tabelas!BD26=\"\",\"\",tabelas!BD26)","v":"Sem correção monetária"},21,"",""]
[null,null,null,null,null,null,null,null,null,null,"POSITIVA","CONTR. PSS",null,null,"",""]
[null,null,null,null,null,null,null,null,null,null,"POSITIVA","CONTR. PSS",null,null,"",""]
[null,null,null,null,null,null,null,null,null,null,"POSITIVA","CONTR. PSS",null,null,"","",null,"POSITIVA"]
[null,null,null,null,null,null,null,null,null,null,null,null,null,null,null,null,null,"NEGATIVA"]
[null,null,null,null,null,null,null,null,null,null,null,null,null,null,null,null,null,null,null,null,null,"JUROS DE MORA"]
[null,null,null,null,null,null,null,null,null,null,null,null,null,null,null,null,null,null,null,null,null,"nr","CRITÉRIO","NR","ORD","CRITÉRIO"]
[]
[null,null,null,null,null,null,null,null,null,null,null,null,null,null,null,null,null,null,null,null,null,1,{"$f":"+IF(tabelas!CM9=\"\",\"\",IF(tabelas!CN9=\"S\",tabelas!CM9,\"\"))","v":"0,5%"},{"$f":"+IF(W35=\"\",\"\",V35)","v":1},{"$f":"+IF(ISERR(SMALL($X$35:$X$46,V35)),\"\",SMALL($X$35:$X$46,V35))","v":1},{"$f":"+IF(Y35=\"\",\"\",LOOKUP(Y35,$V$35:$V$46,$W$35:$W$46))","v":"0,5%"}]
[null,null,null,null,null,null,null,null,null,null,null,null,null,null,null,null,null,null,null,null,null,2,{"$f":"+IF(tabelas!CM10=\"\",\"\",IF(tabelas!CN10=\"S\",tabelas!CM10,\"\"))","v":"0,5% até 6/2009 e após juros poup."},{"$f":"+IF(W36=\"\",\"\",V36)","v":2},{"$f":"+IF(ISERR(SMALL($X$35:$X$46,V36)),\"\",SMALL($X$35:$X$46,V36))","v":2},"0,5% até 6/2009 e após juros poup."]
[null,null,null,null,null,null,null,null,null,null,null,null,null,null,null,null,null,null,null,null,null,3,{"$f":"+IF(tabelas!CM11=\"\",\"\",IF(tabelas!CN11=\"S\",tabelas!CM11,\"\"))","v":"0,5% até 12/2002 após 1% até 6/2009 e após juros poup."},3,3,"0,5% até 12/2002 após 1% até 6/2009 e após juros poup."]
[null,null,null,null,null,null,null,null,null,null,null,null,null,null,null,null,null,null,null,null,null,4,{"$f":"+IF(tabelas!CM12=\"\",\"\",IF(tabelas!CN12=\"S\",tabelas!CM12,\"\"))","v":"1,0%"},4,4,"1,0%"]
[null,null,null,null,null,null,null,null,null,null,null,null,null,null,null,null,null,null,null,null,null,5,{"$f":"+IF(tabelas!CM13=\"\",\"\",IF(tabelas!CN13=\"S\",tabelas!CM13,\"\"))","v":""},"",10,"SELIC"]
[null,null,null,null,null,null,null,null,null,null,null,null,null,null,null,null,null,null,null,null,null,6,{"$f":"+IF(tabelas!CM14=\"\",\"\",IF(tabelas!CN14=\"S\",tabelas!CM14,\"\"))","v":""},"",11,"sem juros moratórios"]
[null,null,null,null,null,null,null,null,null,null,null,null,null,null,null,null,null,null,null,null,null,7,{"$f":"+IF(tabelas!CM15=\"\",\"\",IF(tabelas!CN15=\"S\",tabelas!CM15,\"\"))","v":""},"","",""]
[null,null,null,null,null,null,null,null,null,null,null,null,null,null,null,null,null,null,null,null,null,8,{"$f":"+IF(tabelas!CM16=\"\",\"\",IF(tabelas!CN16=\"S\",tabelas!CM16,\"\"))","v":""},"","",""]
[null,null,null,null,null,null,null,null,null,null,null,null,null,null,null,null,null,null,null,null,null,9,{"$f":"+IF(tabelas!CM17=\"\",\"\",IF(tabelas!CN17=\"S\",tabelas!CM17,\"\"))","v":""},"","",""]
[null,null,null,null,null,null,null,null,null,null,null,null,null,null,null,null,null,null,null,null,null,10,{"$f":"+IF(tabelas!CM18=\"\",\"\",IF(tabelas!CN18=\"S\",tabelas!CM18,\"\"))","v":"SELIC"},10,"",""]
[null,null,null,null,null,null,null,null,null,null,null,null,null,null,null,null,null,null,null,null,null,11,{"$f":"+IF(tabelas!CM19=\"\",\"\",IF(tabelas!CN19=\"S\",tabelas!CM19,\"\"))","v":"sem juros moratórios"},11,"",""]
[null,null,null,null,null,null,null,null,null,null,null,null,null,null,null,null,null,null,null,null,null,12,{"$f":"+IF(tabelas!CM20=\"\",\"\",IF(tabelas!CN20=\"S\",tabelas!CM20,\"\"))","v":""},"","",""]
[]
[]
[]
[null,null,null,null,null,null,null,null,null,null,null,null,null,null,null,null,null,"CRITÉRIO DE CORREÇÃO MONETÁRIA:",null,"Sem correção monetária"]
[null,null,null,null,null,null,null,null,null,null,null,null,null,null,null,null,null,"DATA DE INICIO DE JUROS:",null,null,{"$f":"+IF(T51=\"\",\"\",IF(DAT_INI_JUR>S11,\"Data invalida!\",\"\"))","v":""}]
[]
[null,null,null,null,null,null,null,null,null,null,null,null,null,null,null,null,null,"INFORMAÇÃO COMPLEMENTAR"]

{"sheet":"calculo","index":2,"n_rows":65,"n_cols":16,"rows_kept":65,"cut":false,"hidden":false,"merged":[[2,1,2,11],[3,1,3,11],[4,1,4,11],[5,1,5,11],[7,1,7,3],[6,1,6,11],[7,4,7,10],[14,14,14,15],[11,11,12,11],[54,1,55,10],[47,1,48,4],[11,1,11,5],[11,9,11,10],[11,7,11,8],[8,1,8,3],[11,6,12,6],[47,5,48,11],[8,4,8,10],[58,1,60,10],[41,1,42,4],[43,1,44,4],[45,1,46,4],[52,1,53,10],[41,6,42,10],[43,6,44,10],[45,6,46,10]]}
[]
[]
[null,"PODER JUDICIÁRIO"]
[null,"JUSTIÇA FEDERAL"]
[null,"Seção Judiciária do Rio de Janeiro"]
[null,"CÁLCULO DE ATUALIZAÇÃO"]
[]
[null,"PROCESSO:",null,null,"AUTOR(A) :",null,null,null,null,null,null,"ATUALIZADO ATÉ:"]
[null,{"$f":"+IF(cadastro!D4=\"\",\"\",cadastro!D4)","v":""},null,null,{"$f":"+IF(cadastro!D5=\"\",\"\",PROPER(cadastro!D5))","v":""},null,null,null,null,null,null,{"$f":"+IF(VDAT_AT=\"\",\"\",VDAT_AT)","v":"2021-12-01"}]
[null,"CÁLCULO"]
[]
[null,"DISCRIMINAÇÃO DA PARCELA HISTÓRICA",null,null,null,null,"COEFIC. ATUALIZ.","PARCELA ATUALIZADA",null,"SELIC",null,"VALOR\n TOTAL"]
[null,"DATA","DESCRIÇÃO","FLHS","PRINCIPAL","JUROS",null,"PRINCIPAL","JUROS","%","VALOR"]
[null,{"$f":"+rascunho!O4","v":""},{"$f":"+rascunho!M4","v":""},{"$f":"+rascunho!N4","v":""},{"$f":"+rascunho!Q4","v":""},{"$f":"+rascunho!R4","v":""},{"$f":"+rascunho!S4","v":""},{"$f":"+rascunho!T4","v":""},{"$f":"+rascunho!U4","v":""},{"$f":"+rascunho!V4","v":""},{"$f":"+rascunho!W4","v":""},{"$f":"+rascunho!X4","v":""}]
[null,{"$f":"+rascunho!O5","v":""},{"$f":"+rascunho!M5","v":""},{"$f":"+rascunho!N5","v":""},{"$f":"+rascunho!Q5","v":""},{"$f":"+rascunho!R5","v":""},{"$f":"+rascunho!S5","v":""},{"$f":"+rascunho!T5","v":""},{"$f":"+rascunho!U5","v":""},{"$f":"+rascunho!V5","v":""},{"$f":"+rascunho!W5","v":""},{"$f":"+rascunho!X5","v":""},null,null,"IMPRIME"]
[null,{"$f":"+rascunho!O6","v":""},{"$f":"+rascunho!M6","v":""},{"$f":"+rascunho!N6","v":""},{"$f":"+rascunho!Q6","v":""},{"$f":"+rascunho!R6","v":""},{"$f":"+rascunho!S6","v":""},{"$f":"+rascunho!T6","v":""},{"$f":"+rascunho!U6","v":""},{"$f":"+rascunho!V6","v":""},{"$f":"+rascunho!W6","v":""},{"$f":"+rascunho!X6","v":""},null,null,"B3:L65","cod_imp"]
[null,{"$f":"+rascunho!O7","v":""},{"$f":"+rascunho!M7","v":""},{"$f":"+rascunho!N7","v":""},{"$f":"+rascunho!Q7","v":""},{"$f":"+rascunho!R7","v":""},{"$f":"+rascunho!S7","v":""},{"$f":"+rascunho!T7","v":""},{"$f":"+rascunho!U7","v":""},{"$f":"+rascunho!V7","v":""},{"$f":"+rascunho!W7","v":""},{"$f":"+rascunho!X7","v":""},null,null,false,"sel_imp"]
[null,{"$f":"+rascunho!O8","v":""},{"$f":"+rascunho!M8","v":""},{"$f":"+rascunho!N8","v":""},{"$f":"+rascunho!Q8","v":""},{"$f":"+rascunho!R8","v":""},{"$f":"+rascunho!S8","v":""},{"$f":"+rascunho!T8","v":""},{"$f":"+rascunho!U8","v":""},{"$f":"+rascunho!V8","v":""},{"$f":"+rascunho!W8","v":""},{"$f":"+rascunho!X8","v":""},null,null,true,"vis_imp"]
[null,{"$f":"+rascunho!O9","v":""},{"$f":"+rascunho!M9","v":""},{"$f":"+rascunho!N9","v":""},{"$f":"+rascunho!Q9","v":""},{"$f":"+rascunho!R9","v":""},{"$f":"+rascunho!S9","v":""},{"$f":"+rascunho!T9","v":""},{"$f":"+rascunho!U9","v":""},{"$f":"+rascunho!V9","v":""},{"$f":"+rascunho!W9","v":""},{"$f":"+rascunho!X9","v":""}]
[null,{"$f":"+rascunho!O10","v":""},{"$f":"+rascunho!M10","v":""},{"$f":"+rascunho!N10","v":""},{"$f":"+rascunho!Q10","v":""},{"$f":"+rascunho!R10","v":""},{"$f":"+rascunho!S10","v":""},{"$f":"+rascunho!T10","v":""},{"$f":"+rascunho!U10","v":""},{"$f":"+rascunho!V10","v":""},{"$f":"+rascunho!W10","v":""},{"$f":"+rascunho!X10","v":""}]
[null,{"$f":"+rascunho!O11","v":""},{"$f":"+rascunho!M11","v":""},{"$f":"+rascunho!N11","v":""},{"$f":"+rascunho!Q11","v":""},{"$f":"+rascunho!R11","v":""},{"$f":"+rascunho!S11","v":""},{"$f":"+rascunho!T11","v":""},{"$f":"+rascunho!U11","v":""},{"$f":"+rascunho!V11","v":""},{"$f":"+rascunho!W11","v":""},{"$f":"+rascunho!X11","v":""}]
[null,{"$f":"+rascunho!O12","v":""},{"$f":"+rascunho!M12","v":""},{"$f":"+rascunho!N12","v":""},{"$f":"+rascunho!Q12","v":""},{"$f":"+rascunho!R12","v":""},{"$f":"+rascunho!S12","v":""},{"$f":"+rascunho!T12","v":""},{"$f":"+rascunho!U12","v":""},{"$f":"+rascunho!V12","v":""},{"$f":"+rascunho!W12","v":""},{"$f":"+rascunho!X12","v":""}]
[null,{"$f":"+rascunho!O13","v":""},{"$f":"+rascunho!M13","v":""},{"$f":"+rascunho!N13","v":""},{"$f":"+rascunho!Q13","v":""},{"$f":"+rascunho!R13","v":""},{"$f":"+rascunho!S13","v":""},{"$f":"+rascunho!T13","v":""},{"$f":"+rascunho!U13","v":""},{"$f":"+rascunho!V13","v":""},{"$f":"+rascunho!W13","v":""},{"$f":"+rascunho!X13","v":""}]
[null,{"$f":"+rascunho!O14","v":""},{"$f":"+rascunho!M14","v":""},{"$f":"+rascunho!N14","v":""},{"$f":"+rascunho!Q14","v":""},{"$f":"+rascunho!R14","v":""},{"$f":"+rascunho!S14","v":""},{"$f":"+rascunho!T14","v":""},{"$f":"+rascunho!U14","v":""},{"$f":"+rascunho!V14","v":""},{"$f":"+rascunho!W14","v":""},{"$f":"+rascunho!X14","v":""}]
[null,{"$f":"+rascunho!O15","v":""},{"$f":"+rascunho!M15","v":""},{"$f":"+rascunho!N15","v":""},{"$f":"+rascunho!Q15","v":""},{"$f":"+rascunho!R15","v":""},{"$f":"+rascunho!S15","v":""},{"$f":"+rascunho!T15","v":""},{"$f":"+rascunho!U15","v":""},{"$f":"+rascunho!V15","v":""},{"$f":"+rascunho!W15","v":""},{"$f":"+rascunho!X15","v":""}]
[null,{"$f":"+rascunho!O16","v":""},{"$f":"+rascunho!M16","v":""},{"$f":"+rascunho!N16","v":""},{"$f":"+rascunho!Q16","v":""},{"$f":"+rascunho!R16","v":""},{"$f":"+rascunho!S16","v":""},{"$f":"+rascunho!T16","v":""},{"$f":"+rascunho!U16","v":""},{"$f":"+rascunho!V16","v":""},{"$f":"+rascunho!W16","v":""},{"$f":"+rascunho!X16","v":""}]
[null,{"$f":"+rascunho!O17","v":""},{"$f":"+rascunho!M17","v":""},{"$f":"+rascunho!N17","v":""},{"$f":"+rascunho!Q17","v":""},{"$f":"+rascunho!R17","v":""},{"$f":"+rascunho!S17","v":""},{"$f":"+rascunho!T17","v":""},{"$f":"+rascunho!U17","v":""},{"$f":"+rascunho!V17","v":""},{"$f":"+rascunho!W17","v":""},{"$f":"+rascunho!X17","v":""}]
[null,{"$f":"+rascunho!O18","v":""},{"$f":"+rascunho!M18","v":""},{"$f":"+rascunho!N18","v":""},{"$f":"+rascunho!Q18","v":""},{"$f":"+rascunho!R18","v":""},{"$f":"+rascunho!S18","v":""},{"$f":"+rascunho!T18","v":""},{"$f":"+rascunho!U18","v":""},{"$f":"+rascunho!V18","v":""},{"$f":"+rascunho!W18","v":""},{"$f":"+rascunho!X18","v":""}]
[null,{"$f":"+rascunho!O19","v":""},{"$f":"+rascunho!M19","v":""},{"$f":"+rascunho!N19","v":""},{"$f":"+rascunho!Q19","v":""},{"$f":"+rascunho!R19","v":""},{"$f":"+rascunho!S19","v":""},{"$f":"+rascunho!T19","v":""},{"$f":"+rascunho!U19","v":""},{"$f":"+rascunho!V19","v":""},{"$f":"+rascunho!W19","v":""},{"$f":"+rascunho!X19","v":""}]
[null,{"$f":"+rascunho!O20","v":""},{"$f":"+rascunho!M20","v":""},{"$f":"+rascunho!N20","v":""},{"$f":"+rascunho!Q20","v":""},{"$f":"+rascunho!R20","v":""},{"$f":"+rascunho!S20","v":""},{"$f":"+rascunho!T20","v":""},{"$f":"+rascunho!U20","v":""},{"$f":"+rascunho!V20","v":""},{"$f":"+rascunho!W20","v":""},{"$f":"+rascunho!X20","v":""}]
[null,{"$f":"+rascunho!O21","v":""},{"$f":"+rascunho!M21","v":""},{"$f":"+rascunho!N21","v":""},{"$f":"+rascunho!Q21","v":""},{"$f":"+rascunho!R21","v":""},{"$f":"+rascunho!S21","v":""},{"$f":"+rascunho!T21","v":""},{"$f":"+rascunho!U21","v":""},{"$f":"+rascunho!V21","v":""},{"$f":"+rascunho!W21","v":""},{"$f":"+rascunho!X21","v":""}]
[null,{"$f":"+rascunho!O22","v":""},{"$f":"+rascunho!M22","v":""},{"$f":"+rascunho!N22","v":""},{"$f":"+rascunho!Q22","v":""},{"$f":"+rascunho!R22","v":""},{"$f":"+rascunho!S22","v":""},{"$f":"+rascunho!T22","v":""},{"$f":"+rascunho!U22","v":""},{"$f":"+rascunho!V22","v":""},{"$f":"+rascunho!W22","v":""},{"$f":"+rascunho!X22","v":""}]
[null,{"$f":"+rascunho!O23","v":""},{"$f":"+rascunho!M23","v":""},{"$f":"+rascunho!N23","v":""},{"$f":"+rascunho!Q23","v":""},{"$f":"+rascunho!R23","v":""},{"$f":"+rascunho!S23","v":""},{"$f":"+rascunho!T23","v":""},{"$f":"+rascunho!U23","v":""},{"$f":"+rascunho!V23","v":""},{"$f":"+rascunho!W23","v":""},{"$f":"+rascunho!X23","v":""}]
[null,{"$f":"+rascunho!O24","v":""},{"$f":"+rascunho!M24","v":""},{"$f":"+rascunho!N24","v":""},{"$f":"+rascunho!Q24","v":""},{"$f":"+rascunho!R24","v":""},{"$f":"+rascunho!S24","v":""},{"$f":"+rascunho!T24","v":""},{"$f":"+rascunho!U24","v":""},{"$f":"+rascunho!V24","v":""},{"$f":"+rascunho!W24","v":""},{"$f":"+rascunho!X24","v":""}]
[null,{"$f":"+rascunho!O25","v":""},{"$f":"+rascunho!M25","v":""},{"$f":"+rascunho!N25","v":""},{"$f":"+rascunho!Q25","v":""},{"$f":"+rascunho!R25","v":""},{"$f":"+rascunho!S25","v":""},{"$f":"+rascunho!T25","v":""},{"$f":"+rascunho!U25","v":""},{"$f":"+rascunho!V25","v":""},{"$f":"+rascunho!W25","v":""},{"$f":"+rascunho!X25","v":""}]
[null,{"$f":"+rascunho!O26","v":""},{"$f":"+rascunho!M26","v":""},{"$f":"+rascunho!N26","v":""},{"$f":"+rascunho!Q26","v":""},{"$f":"+rascunho!R26","v":""},{"$f":"+rascunho!S26","v":""},{"$f":"+rascunho!T26","v":""},{"$f":"+rascunho!U26","v":""},{"$f":"+rascunho!V26","v":""},{"$f":"+rascunho!W26","v":""},{"$f":"+rascunho!X26","v":""}]
[null,{"$f":"+rascunho!O27","v":""},{"$f":"+rascunho!M27","v":""},{"$f":"+rascunho!N27","v":""},{"$f":"+rascunho!Q27","v":""},{"$f":"+rascunho!R27","v":""},{"$f":"+rascunho!S27","v":""},{"$f":"+rascunho!T27","v":""},{"$f":"+rascunho!U27","v":""},{"$f":"+rascunho!V27","v":""},{"$f":"+rascunho!W27","v":""},{"$f":"+rascunho!X27","v":""}]
[null,{"$f":"+rascunho!O28","v":""},{"$f":"+rascunho!M28","v":""},{"$f":"+rascunho!N28","v":""},{"$f":"+rascunho!Q28","v":""},{"$f":"+rascunho!R28","v":""},{"$f":"+rascunho!S28","v":""},{"$f":"+rascunho!T28","v":""},{"$f":"+rascunho!U28","v":""},{"$f":"+rascunho!V28","v":""},{"$f":"+rascunho!W28","v":""},{"$f":"+rascunho!X28","v":""}]
[null,null,null,null,null,"TOTAL:",null,{"$f":"+rascunho!T29","v":0},{"$f":"+rascunho!U29","v":0},null,{"$f":"+rascunho!W29","v":0},{"$f":"+rascunho!X29","v":0}]
[]
[null,"RESUMO"]
[null,"TOTAL DO PRINCIPAL (+):",null,null,null,null,{"$f":"+rascunho!AC4","v":0}]
[]
[null,"TOTAL DA CORREÇÃO (+):",null,null,null,null,{"$f":"+rascunho!AC5","v":0}]
[]
[null,"TOTAL DEVIDO (=):",null,null,null,null,{"$f":"+rascunho!AC6","v":0}]
[]
[]
[]
[]
[null,"MEMÓRIA DE CÁLCULO"]
[]
[null,"-Atualização monetária: SELIC (a partir de cada parcela)"]
[]
[]
[]
[]
[]
[null,{"$f":"+IF(cadastro!R54=\"\",\"\",cadastro!R54)","v":""}]
[]
[]
[]
[null,null,null,null,null,null,null,null,null,null,null,{"$f":"+CONCATENATE(\"CÁLCULO DE ATUALIZAÇÃO - PAGINA 1 de 1\")","v":"CÁLCULO DE ATUALIZAÇÃO - PAGINA 1 de 1"}]
[null,{"$f":"+CONCATENATE(SIG_PLAN,\" - \",NOM_VER)","v":"PAV - VERSÃO: 2.2.11.2016-2019"},null,null,null,null,null,null,null,null,null,{"$f":"+CONCATENATE(\"EMITIDO EM: \",TEXT(NOW(),\"d-mm-aaaa\"))","v":"EMITIDO EM: 7-12-2021"}]
[null,"SJRJ - SCA - AUTOMAÇÃO DE FERRAMENTAS PARA CÁLCULO JUDICIAL"]

{"sheet":"sobre","index":3,"n_rows":74,"n_cols":12,"rows_kept":74,"cut":false,"hidden":false,"merged":[[0,0,0,9],[26,1,26,3],[6,1,6,2],[8,1,8,2],[9,1,9,2],[2,1,2,2],[3,1,3,2],[4,1,4,2],[5,1,5,2]]}
[]
[]
[null,"PODER JUDICIÁRIO",null,null,null,"SIGLA:","PAV"]
[null,"JUSTIÇA FEDERAL",null,null,null,"DATA:","2018-11-08"]
[null,"Seção Judiciária do Rio de Janeiro",null,null,null,"VERSÃO:",2]
[null,"SUBSECRETÁRIA DE CÁLCULO JUDICIAL",null,null,null,"REVISÃO:",2]
[null,"AUTOMAÇÃO DE FERRAMENTAS PARA CÁLCULO JUDICIAL",null,null,null,"MÊS:",{"$f":"+MONTH(DAT_PLAN)","v":11}]
[null,null,null,null,null,"ANO INICIAL:",2016]
[null,{"$f":"+NOM_PLAN","v":"CÁLCULO DE ATUALIZAÇÃO DE PSS SOBRE RUBRICA"},null,null,null,"ANO FINAL:",2019]
[null,{"$f":"+NOM_VER","v":"VERSÃO: 2.2.11.2016-2019"},{"$f":"+NOM_VER","v":"VERSÃO: 2.2.11.2016-2019"},null,null,"VERSÂO:",{"$f":"+CONCATENATE(F5,\" \",TEXT(G5,\"#0\"),\".\",TEXT(G6,\"#0\"),\".\",TEXT(G7,\"#0\"),\".\",TEXT(G8,\"#0\"),\"-\",TEXT(G9,\"#0\"))","v":"VERSÃO: 2.2.11.2016-2019"}]
[null,null,null,null,null,"SERIAL:",{"$f":"+CONCATENATE(SIG_PLAN,\"-\",TEXT(G5,\"#00\"),\"-\",TEXT(G6,\"#00\"),\"-\",TEXT(G7,\"#00\"),\"-\",TEXT(G8,\"#0000\"),\"-\",TEXT(G9,\"#0000\"))","v":"PAV-02-02-11-2016-2019"}]
[]
[null,"CONFIGURAÇÕES DO EXCEL"]
[null,"EXCEL 2000-2003",null,null,null,"NOM_PLAN","CÁLCULO DE ATUALIZAÇÃO DE PSS SOBRE RUBRICA"]
[null,null,"1) Habilite no Excel as opções: \"Ferramentas de análise\" e \"Ferramentas de análise – VBA\"."]
[null,null,"(configuração acessível através da opção \"FERRAMENTAS\" e opção \"SUPLEMENTOS\")"]
[null,null,"2) Habilite no Excel o nível de segurança para: \"médio\" ou \"baixo\"."]
[null,null,"(configuração acessível através da opção \"FERRAMENTAS\" opção \"MACRO\" e opção \"SEGURANÇA\")",null,null,"NOM_SETOR","SJRJ - SCA - AUTOMAÇÃO DE FERRAMENTAS PARA CÁLCULO JUDICIAL"]
[null,"EXCEL 2007"]
[null,null,"1) Habilite no Excel as opções: \"Ferramentas de análise\" e \"Ferramentas de análise – VBA\"."]
[null,null,"(configuração acessível através do \"Botão Microsoft Office\"          e, em seguida, clique em \"Opções do Excel\".  Clique em \"Suplementos\" e, na caixa Gerenciar, selecione \"Suplementos do Excel\". Clique em \"Ir para\".)"]
[null,null,"2) Habilite as macros no Excel."]
[null,null,"(configuração acessível através do \"Botão do Microsoft Office\"           e depois em \"Opções do Excel\". Clique em \"Central de Confiabilidade\", clique em \"Configurações da Central de Confiabilidade\" e depois em \"Configurações de Macro\".)"]
[]
[]
[]
[null,"CORREÇÃO MONETÁRIA - SITUAÇÃO DOS ÍNDICES"]
[null,{"$f":"+tabelas!BJ9","v":"- Resolução CJF - 267/2013 (índices cadastrados de jan-2001 até abr-2021)"}]
[null,{"$f":"+tabelas!BJ10","v":"- Resolução CJF - 134/2010 (índices cadastrados de jan-2001 até abr-2021)"}]
[null,{"$f":"+tabelas!BJ11","v":"- TR (índices cadastrados de jan-2001 até abr-2021)"}]
[null,{"$f":"+tabelas!BJ12","v":""}]
[null,{"$f":"+tabelas!BJ13","v":""}]
[null,{"$f":"+tabelas!BJ14","v":""}]
[null,{"$f":"+tabelas!BJ15","v":""}]
[null,{"$f":"+tabelas!BJ16","v":""}]
[null,{"$f":"+tabelas!BJ17","v":"- FGTS-3% (índices cadastrados de jan-1996 até abr-2021)"}]
[null,{"$f":"+tabelas!BJ18","v":""}]
[null,{"$f":"+tabelas!BJ19","v":""}]
[null,{"$f":"+tabelas!BJ20","v":"- FGTS-6% (índices cadastrados de jan-1996 até abr-2021)"}]
[null,{"$f":"+tabelas!BJ21","v":"- JUROS REM FGTS-3% (índices cadastrados de jan-2001 até dez-2021)"}]
[null,{"$f":"+tabelas!BJ22","v":"- JUROS REM FGTS-6% (índices cadastrados de jan-2001 até dez-2021)"}]
[null,{"$f":"+tabelas!BJ16","v":""}]
[]
[null,{"$f":"+SERIAL","v":"PAV-02-02-11-2016-2019"}]
[]
[]
[]
[]
[]
[]
[]
[]
[]
[]
[]
[]
[]
[]
[]
[]
[]
[]
[]
[]
[]
[]
[]
[]
[]
[]
[]
[]
[]
[null,null,null,null,null,null,null,null,null,null,"PROCESSO:",{"$f":"+NUM_PROC1","v":""}]

{"sheet":"tabelas","index":4,"n_rows":400,"n_cols":106,"rows_kept":400,"cut":false,"hidden":true,"merged":[[28,59,28,60],[5,40,5,44],[6,40,6,44],[5,46,5,51],[6,47,6,49],[6,50,7,50],[6,51,7,51],[6,46,7,46],[5,26,5,35],[6,26,6,30],[6,31,6,35],[5,37,5,38],[6,37,6,38],[5,16,5,19],[6,16,6,17],[6,18,6,19],[5,21,5,24],[6,21,6,22],[6,23,6,24],[5,1,5,4],[5,6,5,9],[5,11,5,14],[6,6,6,7],[6,8,6,9],[6,1,6,2],[6,3,6,4],[6,11,6,12],[6,13,6,14],[1,74,1,78],[5,95,7,95],[7,98,7,99],[8,69,67,70],[6,80,7,80],[6,82,7,82],[5,94,7,94],[6,81,7,81],[6,74,6,75],[6,76,6,78],[6,87,7,87],[6,85,7,85],[6,89,6,92],[6,83,7,83],[6,84,7,84],[5,74,5,78],[5,80,5,87],[5,64,7,64],[5,65,7,65],[326,104,326,105],[6,86,7,86],[6,69,6,70],[6,71,6,72],[5,69,5,72],[5,101,5,102],[6,101,6,102],[5,104,5,105],[6,104,6,105]]}
["CORREÇÃO MONETÁRIA (VERIFICADO EM 7/11/2018)"]
[null,null,null,null,null,null,null,null,null,null,null,null,null,null,null,null,null,null,null,null,null,null,null,null,null,null,null,null,null,null,null,null,null,null,null,null,null,"MÊS INICIAL",{"$f":"+AL9","v":"2001-01-01"},null,null,null,null,null,null,null,null,null,null,null,null,null,null,null,null,null,null,null,null,null,null,null,null,null,null,null,null,null,null,null,null,null,null,null,"ok - 4/5/2017"]
[null,"MÊS INICIAL",{"$f":"+M_SM","v":"2000-01-01"},null,null,null,"MÊS INICIAL",{"$f":"+M_IPCAE","v":"2001-01-01"},null,null,null,"MÊS INICIAL",{"$f":"+M_IPCA","v":"2001-01-01"},null,null,null,"MÊS INICIAL",{"$f":"+M_TR","v":"2001-01-01"},null,null,null,"MÊS INICIAL",{"$f":"+M_INPC","v":"2006-09-01"},null,null,null,"MÊS INICIAL",{"$f":"+AF9","v":"1996-01-01"},null,null,null,null,null,null,null,null,null,"MÊS FINAL",{"$f":"+IF(ISERR(LARGE(AL:AL,1)),\"\",LARGE(AL:AL,1))","v":"2021-04-01"},null,"MÊS INICIAL",{"$f":"AO9","v":"2001-01-01"},null,null,null,null,null,null,null,null,null,null,null,null,null,null,null,null,null,null,null,null,null,null,null,null,null,null,null,"MÊS REF:",{"$f":"+EOMONTH(TRUNC(NOW(),0),-1)+1","v":"2021-12-01"},null,null,null,"MÊS REF",{"$f":"+EOMONTH(TRUNC(NOW(),0),-1)+1","v":"2021-12-01"}]
[null,"MÊS FINAL",{"$f":"+IF(ISERR(LARGE(D:D,1)),\"\",LARGE(D:D,1))","v":"2021-12-01"},null,null,null,"MÊS FINAL",{"$f":"+IF(ISERR(LARGE(I:I,1)),\"\",LARGE(I:I,1))","v":"2021-04-01"},null,null,null,"MÊS FINAL",{"$f":"+IF(ISERR(LARGE(N:N,1)),\"\",LARGE(N:N,1))","v":"2021-04-01"},null,null,null,"MÊS FINAL",{"$f":"+IF(ISERR(LARGE(S:S,1)),\"\",LARGE(S:S,1))","v":"2021-04-01"},null,null,null,"MÊS FINAL",{"$f":"+IF(ISERR(LARGE(X:X,1)),\"\",LARGE(X:X,1))","v":"2021-03-01"},null,null,null,"MÊS FINAL",{"$f":"+IF(ISERR(LARGE(AF:AF,1)),\"\",LARGE(AF:AF,1))","v":"2021-04-01"},null,null,null,null,null,null,null,null,null,"ATUALIZA:",{"$f":"+IF(AM3=\"\",\"S\",IF(AM3<AM2,\"S\",\"N\"))","v":"N"},null,"MÊS FINAL",{"$f":"+IF(ISERR(LARGE(AO:AO,1)),\"\",LARGE(AO:AO,1))","v":"2021-12-01"},null,null,null,null,null,null,null,null,null,null,null,null,null,null,null,null,null,null,null,null,null,null,null,null,null,null,null,"MÊS TABELA:",{"$f":"+IF(ISERR(LARGE(BT:BT,1)),\"\",LARGE(BT:BT,1))","v":"2021-04-01"},null,null,null,"MÊS TABELA:",{"$f":"+IF(ISERR(LARGE(BY:BY,1)),\"\",LARGE(BY:BY,1))","v":"2021-04-01"}]
[null,"ATUALIZA:",{"$f":"+IF(C4=\"\",\"S\",IF(C4<VMES99,\"S\",\"N\"))","v":"N"},{"$f":"COLUMN(D5)","v":4},{"$f":"COLUMN(E5)","v":5},null,"ATUALIZA:",{"$f":"+IF(H4=\"\",\"S\",IF(H4<VMES99,\"S\",\"N\"))","v":"S"},{"$f":"COLUMN(I5)","v":9},{"$f":"COLUMN(J5)","v":10},null,"ATUALIZA:",{"$f":"+IF(M4=\"\",\"S\",IF(M4<VMES99,\"S\",\"N\"))","v":"S"},{"$f":"COLUMN(N5)","v":14},{"$f":"COLUMN(O5)","v":15},null,"ATUALIZA:",{"$f":"+IF(R4=\"\",\"S\",IF(R4<VMES99,\"S\",\"N\"))","v":"S"},{"$f":"COLUMN(S5)","v":19},{"$f":"COLUMN(T5)","v":20},null,"ATUALIZA:",{"$f":"+IF(W4=\"\",\"S\",IF(W4<VMES99,\"S\",\"N\"))","v":"S"},{"$f":"COLUMN(X5)","v":24},{"$f":"COLUMN(Y5)","v":25},null,"ATUALIZA:",{"$f":"+IF(AB4=\"\",\"S\",IF(AB4<VMES99,\"S\",\"N\"))","v":"S"},null,null,null,{"$f":"COLUMN(AF5)","v":32},{"$f":"COLUMN(AG5)","v":33},{"$f":"COLUMN(AH5)","v":34},{"$f":"COLUMN(AI5)","v":35},{"$f":"COLUMN(AJ5)","v":36},null,{"$f":"COLUMN(AL5)","v":38},{"$f":"COLUMN(AM5)","v":39},null,{"$f":"COLUMN(AO5)","v":41},{"$f":"COLUMN(AP5)","v":42},{"$f":"COLUMN(AQ5)","v":43},44,45,null,null,null,null,null,null,null,null,null,null,null,null,null,null,null,null,null,null,null,null,null,null,null,null,"ATUALIZA:",{"$f":"+IF(BS4=\"\",\"S\",IF(BS4<BS3,\"S\",\"N\"))","v":"S"},null,null,null,"ATUALIZA:",{"$f":"+IF(BX4=\"\",\"S\",IF(BX4<BX3,\"S\",\"N\"))","v":"S"}]
[null,"SALÁRIO MÍNIMO",null,null,null,null,"Res CJF - 267/2013 (IPCA-E)",null,null,null,null,"IPCA",null,null,null,null,"TR",null,null,null,null,"INPC",null,null,null,null,"FGTS (VERIFICAR)",null,null,null,null,null,null,null,null,null,null,"Res CJF - 134/2010",null,null,"JUROS REMUNERATÓRIO - FGTS",null,null,null,null,null,"CORREÇÃO MONETÁRIA",null,null,null,null,null,null,null,null,null,null,null,null,null,null,null,null,null,"VCOL_NR","VCOL_LT",null,null,null,"RENTABILIDADE - POUPANÇA",null,null,null,null,"SELIC",null,null,null,null,null,"JUROS DE MORA",null,null,null,null,null,null,null,null,null,null,null,null,null,"COL_DAT_CORTE","COL_VAL_CORTE",null,null,{"$f":"+COUNTA(CU9:CU208)","v":5},"NTOT",null,"MODULAÇÃO FUX",null,null,"TR+RENTAB"]
[null,"IMPORTADO",null,"PROCESSADO",null,null,"IMPORTADO",null,"PROCESSADO",null,null,"IMPORTADO",null,"PROCESSADO",null,null,"IMPORTADO",null,"PROCESSADO",null,null,"IMPORTADO",null,"PROCESSADO",null,null,"IMPORTADO",null,null,null,null,"PROCESSADO",null,null,null,null,null,"PROCESSADO",null,null,"PROCESSADO",null,null,null,null,null,"linha","SELEÇÃO DE ÍNDICE",null,null,"COEFICIENTE\nACUMULADO","CORTE",null,null,null,null,null,null,null,null,null,null,null,null,null,null,null,null,null,"IMPORTADO",null,"PROCESSADO",null,null,"IMPORTADO",null,"PROCESSADO",null,null,null,"MÊS/tab","MÊS/calc","JUROS\n(1/4/11)","JUROS\n(2)","JUROS\n(3)","JUROS\n SELIC","JUROS\nSELECIO","ACUMULADO",null,"JUROS DE MORA - ok - 4/5/2017",null,null,null,null,null,null,null,null,{"$f":"+IF(ISNA(MATCH(SERIAL,CV9:CV300,0)),0,MATCH(SERIAL,CV9:CV300,0))","v":0},"NPROC",null,"PROCESSADO",null,null,"PROCESSADO"]
[null,"MÊS","VALOR","MÊS","VALOR",null,"MÊS","VALOR","MÊS","VALOR",null,"MÊS","VALOR","MÊS","VALOR",null,"CRÉDITO","VALOR","ínicio","VALOR",null,"MÊS","VALOR","MÊS","VALOR",null,"MÊS","3%","4%","5%","6%","MÊS","3%","4%","5%","6%",null,"MÊS","VALOR",null,"MÊS","3%","4%","5%","6%",null,null,"MÊS","MÊS","COTAÇÃO",null,null,null,"NR","COD","CRITÉRIO","LETRA",null,"lib","MINÍMO","MÁXIMO","INFOR","HISTÓRICO",null,null,null,null,null,null,"CRÉDITO","VALOR","CRÉDITO","VALOR",null,"MÊS","VALOR","MÊS","MÊS","VALOR",null,null,null,null,null,null,null,null,null,null,"Nr","CRITÉRIO","LIB","HISTÓRICO",null,null,null,null,null,"LISTA DE BLOQUEIO",null,null,"MÊS","VALOR",null,"MÊS","VALOR"]
[null,"2000-01-01",136,{"$f":"+IF(TRIM(B9)=\"\",\"\",B9)","v":"2000-01-01"},{"$f":"+IF(TRIM(C9)=\"\",\"\",C9)","v":136},null,"2001-01-01",6.3E-3,{"$f":"+IF(AND(TRIM(G9)=\"\",TRIM(G8)<>\"\"),EDATE(I8,1),IF(TRIM(G9)=\"\",\"\",TRUNC(G9,0)))","v":"2001-01-01"},{"$f":"+IF(AND(H9=\"\",H8<>\"\"),0,IF(TRIM(H9)=\"\",\"\",H9))","v":6.3E-3},null,"2001-01-01",5.7000000000000002E-3,{"$f":"+IF(TRIM(L9)=\"\",\"\",TRUNC(L9,0))","v":"2001-01-01"},{"$f":"+IF(TRIM(M9)=\"\",\"\",M9)","v":5.7000000000000002E-3},null,"2001-01-01",1.369E-3,{"$f":"+IF(AND(TRIM(Q9)=\"\",TRIM(Q8)<>\"\"),EDATE(S8,1),IF(TRIM(Q9)=\"\",\"\",TRUNC(Q9,0)))","v":"2001-01-01"},{"$f":"+IF(AND(R9=\"\",R8<>\"\"),0,IF(TRIM(R9)=\"\",\"\",R9))","v":1.369E-3},null,"2006-09-01",1.6000000000000001E-3,{"$f":"+IF(AND(TRIM(V9)=\"\",TRIM(V8)<>\"\"),EDATE(X8,1),IF(TRIM(V9)=\"\",\"\",TRUNC(V9,0)))","v":"2006-09-01"},{"$f":"+IF(AND(W9=\"\",W8<>\"\"),0,IF(TRIM(W9)=\"\",\"\",W9))","v":1.6000000000000001E-3},null,null,null,null,null,null,"1996-01-01",1.5023E-2,1.584E-2,1.6650999999999999E-2,1.7454000000000001E-2,null,{"$f":"+I9","v":"2001-01-01"},{"$f":"+J9","v":6.3E-3},null,"2001-01-01",2.4659999999999999E-3,3.2729999999999999E-3,4.0740000000000004E-3,4.8669999999999998E-3,null,9,{"$f":"IF(INDIRECT(CONCATENATE(VLET_DT,TEXT(AU9,\"#0\")))=\"\",\"\",INDIRECT(CONCATENATE(VLET_DT,TEXT(AU9,\"#0\"))))","v":{"$error":"#REF!"}},{"$f":"+IF(AV9=\"\",\"\",IF(AV9<=VDAT_AT,AV9,\"\"))","v":{"$error":"#REF!"}},{"$f":"IF(OR(AW9=\"\",INDIRECT(CONCATENATE(VLET_COT,TEXT(AU9,\"#0\")))=\"\"),\"\",IF(AW9=VDAT_AT,1+IF(COD_CM=4,0.01,0),INDIRECT(CONCATENATE(VLET_COT,TEXT(AU9,\"#0\")))))","v":{"$error":"#REF!"}},{"$f":"+IF(COD_CM=4,IF(AX9=\"\",\"\",AX9+IF(AY10=\"\",0,AY10)),IF(OR(AV9>VDAT_AT,AV9=\"\"),\"\",IF(AV9=VDAT_AT,1,IF(AY10=\"\",1,AY10)*(1+AX9)/AZ9)))","v":{"$error":"#REF!"}},{"$f":"+IF(AW9=\"\",\"\",LOOKUP(AW9,COL_DAT_CORTE,COL_VAL_CORTE))","v":{"$error":"#REF!"}},null,1,1,{"$f":"+IF(BG9=\"N\",\"\",\"Resolução CJF - 267/2013\")","v":"Resolução CJF - 267/2013"},{"$f":"+LOOKUP(I5,VCOL_NR,VCOL_LET)","v":"I"},{"$f":"+LOOKUP(J5,VCOL_NR,VCOL_LET)","v":"J"},"s",{"$f":"+H3","v":"2001-01-01"},{"$f":"+H4","v":"2021-04-01"},{"$f":"+IF(BG9=\"N\",\"\",CONCATENATE(\"- \",BD9,\" (índices cadastrados de \",TEXT(EDATE(BH9,0),\"MMM-AAAA\"),\" até \",TEXT(EDATE(BI9,0),\"MMM-AAAA\"),\")\"))","v":"- Resolução CJF - 267/2013 (índices cadastrados de jan-2001 até abr-2021)"},"Resolução CJF - 267/2013 - Correção monetária pelo IPCA-E",null,1,"A",null,null,null,null,null,"1996-01-01",5.0000000000000001E-3,null,"1996-01-01",2.58E-2,{"$f":"+IF(AND(TRIM(BW9)=\"\",TRIM(BW8)<>\"\"),EDATE(BY8,1),IF(TRIM(BW9)=\"\",\"\",TRUNC(BW9,0)))","v":"1996-01-01"},{"$f":"+IF(BY9=\"\",\"\",IF(BY9<=VDAT_AT,BY9,\"\"))","v":"1996-01-01"},{"$f":"+IF(BY9>VDAT_AT,\"\",IF(AND(BZ9<>\"\",BZ10=\"\"),0.01,IF(TRIM(BX9)=\"\",\"\",BX9)))","v":2.58E-2},null,{"$f":"+IF(BT9=\"\",\"\",BT9)","v":"1996-01-01"},{"$f":"+IF(CC9=\"\",\"\",IF(CC9<=VDAT_AT1,CC9,\"\"))","v":"1996-01-01"},{"$f":"+IF(CC9=\"\",\"\",IF(COD_JUROS=1,0.5%,IF(COD_JUROS=4,1%,IF(COD_JUROS=11,0%,\"\"))))","v":""},{"$f":"+IF(OR(COD_JUROS<>2,CD9=\"\"),\"\",BU9)","v":""},{"$f":"+IF(OR(COD_JUROS<>3,CD9=\"\"),\"\",0.5%)","v":""},{"$f":"+IF(OR(COD_JUROS<>10,CD9=\"\"),\"\",CA9)","v":2.58E-2},{"$f":"+IF(CD9=\"\",\"\",SUM(CE9:CH9))","v":2.58E-2},{"$f":"+IF(CI9=\"\",\"\",IF(CD9=VDAT_AT1,0,CI10+IF(CJ10=\"\",0,CJ10)))","v":3.4172999999999991},null,1,"0,5%","S","0,5% ao mês.",null,"1950-01-01",1,null,"M_SERIAL","PCGD-05-05-10-2010-2016",{"$f":"+IF(CU9=\"\",\"\",TRIM(CU9))","v":"PCGD-05-05-10-2010-2016"},null,{"$f":"+I9","v":"2001-01-01"},{"$f":"+J9","v":6.3E-3},null,{"$f":"+S9","v":"2001-01-01"},{"$f":"+IF(OR(T9=\"\",BU69=\"\"),\"\",((1+T9)*(1+BU69)-1))","v":6.3758449999997691E-3}]
[null,"2000-02-01",136,{"$f":"+IF(TRIM(B10)=\"\",\"\",B10)","v":"2000-02-01"},136,null,"2001-02-01",5.0000000000000001E-3,"2001-02-01",5.0000000000000001E-3,null,"2001-02-01",4.5999999999999999E-3,"2001-02-01",{"$f":"+IF(TRIM(M10)=\"\",\"\",M10)","v":4.5999999999999999E-3},null,"2001-02-01",3.68E-4,"2001-02-01",3.68E-4,null,"2006-10-01",4.3E-3,"2006-10-01",4.3E-3,null,null,null,null,null,null,"1996-02-01",1.2115000000000001E-2,1.2930000000000001E-2,1.3738E-2,1.4539E-2,null,"2001-02-01",5.0000000000000001E-3,null,"2001-02-01",2.4659999999999999E-3,3.2729999999999999E-3,4.0740000000000004E-3,4.8669999999999998E-3,null,10,{"$error":"#REF!"},{"$error":"#REF!"},{"$error":"#REF!"},{"$error":"#REF!"},{"$error":"#REF!"},null,2,2,{"$f":"+IF(BG10=\"N\",\"\",\"Resolução CJF - 134/2010\")","v":"Resolução CJF - 134/2010"},{"$f":"+LOOKUP(AL5,VCOL_NR,VCOL_LET)","v":"AL"},{"$f":"+LOOKUP(AM5,VCOL_NR,VCOL_LET)","v":"AM"},"s",{"$f":"+AM2","v":"2001-01-01"},{"$f":"+AM3","v":"2021-04-01"},"- Resolução CJF - 134/2010 (índices cadastrados de jan-2001 até abr-2021)","Resolução CJF - 134/2010 - Correção monetária pelo IPCA-E até jun/2009 e após correção pela TR.",null,2,"B"," ",null,null,null,null,"1996-02-01",5.0000000000000001E-3,null,"1996-02-01",2.35E-2,"1996-02-01","1996-02-01",2.35E-2,null,"1996-02-01",{"$f":"+IF(CD9=\"\",\"\",IF(EDATE(CD9,1)<=VDAT_AT1,EDATE(CD9,1),\"\"))","v":"1996-02-01"},"","","",2.35E-2,{"$f":"+IF(CD10=\"\",\"\",SUM(CE10:CH10))","v":2.35E-2},3.3937999999999993,null,2,"0,5% até 6/2009 e após juros poup.","S","0,5% ao mês até JUN/2009 e após juros remuneratório da poupança.",null,"1986-02-01",1,null,null,"xPCGD-04-05-10-200-2016",{"$f":"+IF(CU10=\"\",\"\",TRIM(CU10))","v":"xPCGD-04-05-10-200-2016"},null,"2001-02-01",5.0000000000000001E-3,null,"2001-02-01",5.369839999999737E-3]
[null,"2000-03-01",136,"2000-03-01",136,null,"2001-03-01",3.5999999999999999E-3,"2001-03-01",3.5999999999999999E-3,null,"2001-03-01",3.8E-3,"2001-03-01",3.8E-3,null,"2001-03-01",1.7240000000000001E-3,"2001-03-01",1.7240000000000001E-3,null,"2006-11-01",4.1999999999999997E-3,"2006-11-01",4.1999999999999997E-3,null,null,null,null,null,null,"1996-03-01",1.0625000000000001E-2,1.1439E-2,1.2246E-2,1.3046E-2,null,"2001-03-01",3.5999999999999999E-3,null,"2001-03-01",2.4659999999999999E-3,3.2729999999999999E-3,4.0740000000000004E-3,4.8669999999999998E-3,null,11,{"$error":"#REF!"},{"$error":"#REF!"},{"$error":"#REF!"},{"$error":"#REF!"},{"$error":"#REF!"},null,3,3,{"$f":"+IF(BG11=\"N\",\"\",\"TR\")","v":"TR"},{"$f":"+LOOKUP(S5,VCOL_NR,VCOL_LET)","v":"S"},{"$f":"+LOOKUP(T5,VCOL_NR,VCOL_LET)","v":"T"},"s",{"$f":"+R3","v":"2001-01-01"},{"$f":"+R4","v":"2021-04-01"},"- TR (índices cadastrados de jan-2001 até abr-2021)","Correção monetária pela TR.",null,3,"C",null,null,null,null,null,"1996-03-01",5.0000000000000001E-3,null,"1996-03-01",2.2200000000000001E-2,"1996-03-01","1996-03-01",2.2200000000000001E-2,null,"1996-03-01","1996-03-01","","","",2.2200000000000001E-2,2.2200000000000001E-2,3.371599999999999,null,3,"0,5% até 12/2002 após 1% até 6/2009 e após juros poup.","S","0,5% ao mês até DEZ/2002, após 1,0% até JUN/2009 e após juros remuneratório da poupança.",null,"1986-03-01",1000,null,null,"xPAV-09-05-04-2016-2016","xPAV-09-05-04-2016-2016",null,"2001-03-01",3.5999999999999999E-3,null,"2001-03-01",6.732619999999967E-3]
[null,"2000-04-01",151,"2000-04-01",151,null,"2001-04-01",5.0000000000000001E-3,"2001-04-01",5.0000000000000001E-3,null,"2001-04-01",5.7999999999999996E-3,"2001-04-01",5.7999999999999996E-3,null,"2001-04-01",1.5460000000000001E-3,"2001-04-01",1.5460000000000001E-3,null,"2006-12-01",6.1999999999999998E-3,"2006-12-01",6.1999999999999998E-3,null,null,null,null,null,null,"1996-04-01",9.0790000000000003E-3,9.8919999999999998E-3,1.0697E-2,1.1495999999999999E-2,null,"2001-04-01",5.0000000000000001E-3,null,"2001-04-01",2.4659999999999999E-3,3.2729999999999999E-3,4.0740000000000004E-3,4.8669999999999998E-3,null,12,{"$error":"#REF!"},{"$error":"#REF!"},{"$error":"#REF!"},{"$error":"#REF!"},{"$error":"#REF!"},null,4,4,{"$f":"+IF(BG12=\"N\",\"\",\"SELIC\")","v":""},null,null,"n",null,null,{"$f":"+IF(BG12=\"N\",\"\",CONCATENATE(\"- \",BD12,\" (índices cadastrados de \",TEXT(EDATE(BH12,0),\"MMM-AAAA\"),\" até \",TEXT(EDATE(BI12,0),\"MMM-AAAA\"),\")\"))","v":""},"Correção monetária pela SELIC.",null,4,"D",null,null,null,null,null,"1996-04-01",5.0000000000000001E-3,null,"1996-04-01",2.07E-2,"1996-04-01","1996-04-01",2.07E-2,null,"1996-04-01","1996-04-01","","","",2.07E-2,2.07E-2,3.3508999999999989,null,4,"1,0%","S","1,0% ao mês.",null,"1986-06-01",1,null,null,"xPAV-09-05-04-2016-2017","xPAV-09-05-04-2016-2017",null,"2001-04-01",5.0000000000000001E-3,null,"2001-04-01",6.5537300000000354E-3]
[null,"2000-05-01",151,"2000-05-01",151,null,"2001-05-01",4.8999999999999998E-3,"2001-05-01",4.8999999999999998E-3,null,"2001-05-01",4.1000000000000003E-3,"2001-05-01",4.1000000000000003E-3,null,"2001-05-01",1.8270000000000001E-3,"2001-05-01",1.8270000000000001E-3,null,"2007-01-01",4.8999999999999998E-3,"2007-01-01",4.8999999999999998E-3,null,null,null,null,null,null,"1996-05-01",8.3680000000000004E-3,9.1809999999999999E-3,9.9860000000000001E-3,1.0784E-2,null,"2001-05-01",4.8999999999999998E-3,null,"2001-05-01",2.4659999999999999E-3,3.2729999999999999E-3,4.0740000000000004E-3,4.8669999999999998E-3,null,13,{"$error":"#REF!"},{"$error":"#REF!"},{"$error":"#REF!"},{"$error":"#REF!"},{"$error":"#REF!"},null,5,5,{"$f":"+IF(BG13=\"N\",\"\",\"IPCA-E\")","v":""},null,null,"n",null,null,"","Correção monetária pelo IPCA-E.",null,5,"E",null,null,null,null,null,"1996-05-01",5.0000000000000001E-3,null,"1996-05-01",2.01E-2,"1996-05-01","1996-05-01",2.01E-2,null,"1996-05-01","1996-05-01","","","",2.01E-2,2.01E-2,3.3307999999999991,null,5,null,null,null,null,"1986-09-01",1,null,null,"PAV-01-01-04-2016-2017 ","PAV-01-01-04-2016-2017",null,"2001-05-01",4.8999999999999998E-3,null,"2001-05-01",6.8361349999999099E-3]
[null,"2000-06-01",151,"2000-06-01",151,null,"2001-06-01",3.8E-3,"2001-06-01",3.8E-3,null,"2001-06-01",5.1999999999999998E-3,"2001-06-01",5.1999999999999998E-3,null,"2001-06-01",1.4580000000000001E-3,"2001-06-01",1.4580000000000001E-3,null,"2007-02-01",4.1999999999999997E-3,"2007-02-01",4.1999999999999997E-3,null,null,null,null,null,null,"1996-06-01",8.5800000000000008E-3,9.3919999999999993E-3,1.0196999999999999E-2,1.0996000000000001E-2,null,"2001-06-01",3.8E-3,null,"2001-06-01",2.4659999999999999E-3,3.2729999999999999E-3,4.0740000000000004E-3,4.8669999999999998E-3,null,14,{"$error":"#REF!"},{"$error":"#REF!"},{"$error":"#REF!"},{"$error":"#REF!"},{"$error":"#REF!"},null,6,6,{"$f":"+IF(BG14=\"N\",\"\",\"INPC\")","v":""},null,null,"n",null,null,"","Correção monetária pelo INPC.",null,6,"F",null,null,null,null,null,"1996-06-01",5.0000000000000001E-3,null,"1996-06-01",1.9800000000000002E-2,"1996-06-01","1996-06-01",1.9800000000000002E-2,null,"1996-06-01","1996-06-01","","","",1.9800000000000002E-2,1.9800000000000002E-2,3.3109999999999991,null,6,null,null,null,null,"1988-12-01",1,null,null,null,"",null,"2001-06-01",3.8E-3,null,"2001-06-01",6.4652899999999569E-3]
[null,"2000-07-01",151,"2000-07-01",151,null,"2001-07-01",9.4000000000000004E-3,"2001-07-01",9.4000000000000004E-3,null,"2001-07-01",1.3299999999999999E-2,"2001-07-01",1.3299999999999999E-2,null,"2001-07-01",2.441E-3,"2001-07-01",2.441E-3,null,"2007-03-01",4.4000000000000003E-3,"2007-03-01",4.4000000000000003E-3,null,null,null,null,null,null,"1996-07-01",8.3309999999999999E-3,9.1430000000000001E-3,9.9480000000000002E-3,1.0747E-2,null,"2001-07-01",9.4000000000000004E-3,null,"2001-07-01",2.4659999999999999E-3,3.2729999999999999E-3,4.0740000000000004E-3,4.8669999999999998E-3,null,15,{"$error":"#REF!"},{"$error":"#REF!"},{"$error":"#REF!"},{"$error":"#REF!"},{"$error":"#REF!"},null,7,8,{"$f":"+IF(BG15=\"N\",\"\",\"Res CJF - 134/2010 c/ modulação\")","v":""},null,null,"n",null,null,"","Correção monetária pelo IPCA-E até jun/2009 e após correção pela TR até mar/2015 e após pelo IPCA-E.",null,7,"G"," ",null,null,null,null,"1996-07-01",5.0000000000000001E-3,null,"1996-07-01",1.9300000000000001E-2,"1996-07-01","1996-07-01",1.9300000000000001E-2,null,"1996-07-01","1996-07-01","","","",1.9300000000000001E-2,1.9300000000000001E-2,3.2916999999999992,null,7,"",null,null,null,"1989-03-01",1000,null,null,null,"",null,"2001-07-01",9.4000000000000004E-3,null,"2001-07-01",7.4532049999997962E-3]
[null,"2000-08-01",151,"2000-08-01",151,null,"2001-08-01",1.18E-2,"2001-08-01",1.18E-2,null,"2001-08-01",7.0000000000000001E-3,"2001-08-01",7.0000000000000001E-3,null,"2001-08-01",3.4359999999999998E-3,"2001-08-01",3.4359999999999998E-3,null,"2007-04-01",2.5999999999999999E-3,"2007-04-01",2.5999999999999999E-3,null,null,null,null,null,null,"1996-08-01",8.7559999999999999E-3,9.5689999999999994E-3,1.0374E-2,1.1173000000000001E-2,null,"2001-08-01",1.18E-2,null,"2001-08-01",2.4659999999999999E-3,3.2729999999999999E-3,4.0740000000000004E-3,4.8669999999999998E-3,null,16,{"$error":"#REF!"},{"$error":"#REF!"},{"$error":"#REF!"},{"$error":"#REF!"},{"$error":"#REF!"},null,8,7,{"$f":"+IF(BG16=\"N\",\"\",\"POUPANÇA\")","v":""},null,null,"n",null,null,"","Correção monetária pela poupança (tr+rentabilidade).",null,8,"H",null,null,null,null,null,"1996-08-01",5.0000000000000001E-3,null,"1996-08-01",1.9699999999999999E-2,"1996-08-01","1996-08-01",1.9699999999999999E-2,null,"1996-08-01","1996-08-01","","","",1.9699999999999999E-2,1.9699999999999999E-2,3.2719999999999994,null,8,"",null,null,null,"1989-04-01",1,null,null,null,"",null,"2001-08-01",1.18E-2,null,"2001-08-01",8.453179999999838E-3]
[null,"2000-09-01",151,"2000-09-01",151,null,"2001-09-01",3.8E-3,"2001-09-01",3.8E-3,null,"2001-09-01",2.8E-3,"2001-09-01",2.8E-3,null,"2001-09-01",1.627E-3,"2001-09-01",1.627E-3,null,"2007-05-01",2.5999999999999999E-3,"2007-05-01",2.5999999999999999E-3,null,null,null,null,null,null,"1996-09-01",9.1020000000000007E-3,9.9150000000000002E-3,1.0721E-2,1.1519E-2,null,"2001-09-01",3.8E-3,null,"2001-09-01",2.4659999999999999E-3,3.2729999999999999E-3,4.0740000000000004E-3,4.8669999999999998E-3,null,17,{"$error":"#REF!"},{"$error":"#REF!"},{"$error":"#REF!"},{"$error":"#REF!"},{"$error":"#REF!"},null,9,9,{"$f":"+IF(BG17=\"N\",\"\",\"FGTS-3%\")","v":"FGTS-3%"},{"$f":"+LOOKUP(AF5,VCOL_NR,VCOL_LET)","v":"AF"},{"$f":"+LOOKUP(AG5,VCOL_NR,VCOL_LET)","v":"AG"},"s",{"$f":"AB3","v":"1996-01-01"},{"$f":"+AB4","v":"2021-04-01"},"- FGTS-3% (índices cadastrados de jan-1996 até abr-2021)","Correção monetária pelos índices do FGTS (3%).",null,9,"I",null,null,null,null,null,"1996-09-01",5.0000000000000001E-3,null,"1996-09-01",1.9E-2,"1996-09-01","1996-09-01",1.9E-2,null,"1996-09-01","1996-09-01","","","",1.9E-2,1.9E-2,3.2529999999999992,null,9,"",null,null,null,"1993-07-01",1,null,null,null,"",null,"2001-09-01",3.8E-3,null,"2001-09-01",6.6351350000000142E-3]
[null,"2000-10-01",151,"2000-10-01",151,null,"2001-10-01",3.7000000000000002E-3,"2001-10-01",3.7000000000000002E-3,null,"2001-10-01",8.3000000000000001E-3,"2001-10-01",8.3000000000000001E-3,null,"2001-10-01",2.9129999999999998E-3,"2001-10-01",2.9129999999999998E-3,null,"2007-06-01",3.0999999999999999E-3,"2007-06-01",3.0999999999999999E-3,null,null,null,null,null,null,"1996-10-01",9.9030000000000003E-3,1.0717000000000001E-2,1.1523E-2,1.2322E-2,null,"2001-10-01",3.7000000000000002E-3,null,"2001-10-01",2.4659999999999999E-3,3.2729999999999999E-3,4.0740000000000004E-3,4.8669999999999998E-3,null,18,{"$error":"#REF!"},{"$error":"#REF!"},{"$error":"#REF!"},{"$error":"#REF!"},{"$error":"#REF!"},null,10,10,{"$f":"+IF(BG18=\"N\",\"\",\"FGTS-4%\")","v":""},{"$f":"+LOOKUP(AF5,VCOL_NR,VCOL_LET)","v":"AF"},{"$f":"+LOOKUP(AH5,VCOL_NR,VCOL_LET)","v":"AH"},"n",null,null,"","Correção monetária pelos índices do FGTS (4%).",null,10,"J",null,null,null,null,null,"1996-10-01",5.0000000000000001E-3,null,"1996-10-01",1.8599999999999998E-2,"1996-10-01","1996-10-01",1.8599999999999998E-2,null,"1996-10-01","1996-10-01","","","",1.8599999999999998E-2,1.8599999999999998E-2,3.2343999999999991,null,10,"SELIC","S","SELIC",null,"1993-08-01",1000,null,null,null,"",null,"2001-10-01",3.7000000000000002E-3,null,"2001-10-01",7.9275649999999143E-3]
[null,"2000-11-01",151,"2000-11-01",151,null,"2001-11-01",9.9000000000000008E-3,"2001-11-01",9.9000000000000008E-3,null,"2001-11-01",7.1000000000000004E-3,"2001-11-01",7.1000000000000004E-3,null,"2001-11-01",1.928E-3,"2001-11-01",1.928E-3,null,"2007-07-01",3.2000000000000002E-3,"2007-07-01",3.2000000000000002E-3,null,null,null,null,null,null,"1996-11-01",1.0632000000000001E-2,1.1446E-2,1.2253E-2,1.3053E-2,null,"2001-11-01",9.9000000000000008E-3,null,"2001-11-01",2.4659999999999999E-3,3.2729999999999999E-3,4.0740000000000004E-3,4.8669999999999998E-3,null,19,{"$error":"#REF!"},{"$error":"#REF!"},{"$error":"#REF!"},{"$error":"#REF!"},{"$error":"#REF!"},null,11,11,{"$f":"+IF(BG19=\"N\",\"\",\"FGTS-5%\")","v":""},{"$f":"+LOOKUP(AF5,VCOL_NR,VCOL_LET)","v":"AF"},{"$f":"+LOOKUP(AI5,VCOL_NR,VCOL_LET)","v":"AI"},"n",null,null,"","Correção monetária pelos índices do FGTS (5%).",null,11,"K",null,null,null,null,null,"1996-11-01",5.0000000000000001E-3,null,"1996-11-01",1.7999999999999999E-2,"1996-11-01","1996-11-01",1.7999999999999999E-2,null,"1996-11-01","1996-11-01","","","",1.7999999999999999E-2,1.7999999999999999E-2,3.2163999999999993,null,11,"sem juros moratórios","S","-Sem juros moratórios",null,"1993-09-01",1,null,null,null,"",null,"2001-11-01",9.9000000000000008E-3,null,"2001-11-01",6.9376399999998561E-3]
[null,"2000-12-01",151,"2000-12-01",151,null,"2001-12-01",5.4999999999999997E-3,"2001-12-01",5.4999999999999997E-3,null,"2001-12-01",6.4999999999999997E-3,"2001-12-01",6.4999999999999997E-3,null,"2001-12-01",1.983E-3,"2001-12-01",1.983E-3,null,"2007-08-01",5.8999999999999999E-3,"2007-08-01",5.8999999999999999E-3,null,null,null,null,null,null,"1996-12-01",1.1204E-2,1.2019E-2,1.2826000000000001E-2,1.3625999999999999E-2,null,"2001-12-01",5.4999999999999997E-3,null,"2001-12-01",2.4659999999999999E-3,3.2729999999999999E-3,4.0740000000000004E-3,4.8669999999999998E-3,null,20,{"$error":"#REF!"},{"$error":"#REF!"},{"$error":"#REF!"},{"$error":"#REF!"},{"$error":"#REF!"},null,12,12,{"$f":"+IF(BG20=\"N\",\"\",\"FGTS-6%\")","v":"FGTS-6%"},{"$f":"+LOOKUP(AF5,VCOL_NR,VCOL_LET)","v":"AF"},{"$f":"+LOOKUP(AJ5,VCOL_NR,VCOL_LET)","v":"AJ"},"s",{"$f":"+AB3","v":"1996-01-01"},{"$f":"+AB4","v":"2021-04-01"},"- FGTS-6% (índices cadastrados de jan-1996 até abr-2021)","Correção monetária pelos índices do FGTS (6%).",null,12,"L",null,null,null,null,null,"1996-12-01",5.0000000000000001E-3,null,"1996-12-01",1.7999999999999999E-2,"1996-12-01","1996-12-01",1.7999999999999999E-2,null,"1996-12-01","1996-12-01","","","",1.7999999999999999E-2,1.7999999999999999E-2,3.1983999999999995,null,null,null,null,null,null,"1994-06-01",1,null,null,null,"",null,"2001-12-01",5.4999999999999997E-3,null,"2001-12-01",6.9929149999998774E-3]
[null,"2001-01-01",151,"2001-01-01",151,null,"2002-01-01",6.1999999999999998E-3,"2002-01-01",6.1999999999999998E-3,null,"2002-01-01",5.1999999999999998E-3,"2002-01-01",5.1999999999999998E-3,null,"2002-01-01",2.591E-3,"2002-01-01",2.591E-3,null,"2007-09-01",2.5000000000000001E-3,"2007-09-01",2.5000000000000001E-3,null,null,null,null,null,null,"1997-01-01",9.9240000000000005E-3,1.0737999999999999E-2,1.1544E-2,1.2343E-2,null,"2002-01-01",6.1999999999999998E-3,null,"2002-01-01",2.4659999999999999E-3,3.2729999999999999E-3,4.0740000000000004E-3,4.8669999999999998E-3,null,21,{"$error":"#REF!"},{"$error":"#REF!"},{"$error":"#REF!"},{"$error":"#REF!"},{"$error":"#REF!"},null,13,13,{"$f":"+IF(BG21=\"N\",\"\",\"JUROS REM FGTS-3%\")","v":"JUROS REM FGTS-3%"},{"$f":"+LOOKUP(AO5,VCOL_NR,VCOL_LET)","v":"AO"},{"$f":"+LOOKUP(AP5,VCOL_NR,VCOL_LET)","v":"AP"},"s",{"$f":"+AP3","v":"2001-01-01"},{"$f":"+AP4","v":"2021-12-01"},"- JUROS REM FGTS-3% (índices cadastrados de jan-2001 até dez-2021)","Correção monetária pelos índices remuneratórios do FGTS (3%).",null,13,"M",null,null,null,null,null,"1997-01-01",5.0000000000000001E-3,null,"1997-01-01",1.7299999999999999E-2,"1997-01-01","1997-01-01",1.7299999999999999E-2,null,"1997-01-01","1997-01-01","","","",1.7299999999999999E-2,1.7299999999999999E-2,3.1810999999999994,null,null,null,null,null,null,"1994-07-01",2750,null,null,null,"",null,"2002-01-01",6.1999999999999998E-3,null,"2002-01-01",7.6039549999999956E-3]
[null,"2001-02-01",151,"2001-02-01",151,null,"2002-02-01",4.4000000000000003E-3,"2002-02-01",4.4000000000000003E-3,null,"2002-02-01",3.5999999999999999E-3,"2002-02-01",3.5999999999999999E-3,null,"2002-02-01",1.1709999999999999E-3,"2002-02-01",1.1709999999999999E-3,null,"2007-10-01",3.0000000000000001E-3,"2007-10-01",3.0000000000000001E-3,null,null,null,null,null,null,"1997-02-01",9.0980000000000002E-3,9.9109999999999997E-3,1.0717000000000001E-2,1.1514999999999999E-2,null,"2002-02-01",4.4000000000000003E-3,null,"2002-02-01",2.4659999999999999E-3,3.2729999999999999E-3,4.0740000000000004E-3,4.8669999999999998E-3,null,22,{"$error":"#REF!"},{"$error":"#REF!"},{"$error":"#REF!"},{"$error":"#REF!"},{"$error":"#REF!"},null,14,14,{"$f":"+IF(BG22=\"N\",\"\",\"JUROS REM FGTS-6%\")","v":"JUROS REM FGTS-6%"},{"$f":"+LOOKUP(AO5,VCOL_NR,VCOL_LET)","v":"AO"},{"$f":"+LOOKUP(AS5,VCOL_NR,VCOL_LET)","v":"AS"},"s",{"$f":"+AP3","v":"2001-01-01"},{"$f":"+AP4","v":"2021-12-01"},"- JUROS REM FGTS-6% (índices cadastrados de jan-2001 até dez-2021)","Correção monetária pelos índices remuneratórios do FGTS (6%).",null,14,"N",null,null,null,null,null,"1997-02-01",5.0000000000000001E-3,null,"1997-02-01",1.67E-2,"1997-02-01","1997-02-01",1.67E-2,null,"1997-02-01","1997-02-01","","","",1.67E-2,1.67E-2,3.1643999999999992,null,null,null,null,null,null,"1994-08-01",1,null,null,null,"",null,"2002-02-01",4.4000000000000003E-3,null,"2002-02-01",6.1768549999998701E-3]
[null,"2001-03-01",151,"2001-03-01",151,null,"2002-03-01",4.0000000000000001E-3,"2002-03-01",4.0000000000000001E-3,null,"2002-03-01",6.0000000000000001E-3,"2002-03-01",6.0000000000000001E-3,null,"2002-03-01",1.758E-3,"2002-03-01",1.758E-3,null,"2007-11-01",4.3E-3,"2007-11-01",4.3E-3,null,null,null,null,null,null,"1997-03-01",8.7969999999999993E-3,9.6100000000000005E-3,1.0415000000000001E-2,1.1214E-2,null,"2002-03-01",4.0000000000000001E-3,null,"2002-03-01",2.4659999999999999E-3,3.2729999999999999E-3,4.0740000000000004E-3,4.8669999999999998E-3,null,23,{"$error":"#REF!"},{"$error":"#REF!"},{"$error":"#REF!"},{"$error":"#REF!"},{"$error":"#REF!"},null,15,15,{"$f":"+IF(BG23=\"N\",\"\",\"JUROS REM FGTS-5%\")","v":"JUROS REM FGTS-5%"},{"$f":"+LOOKUP(AO5,VCOL_NR,VCOL_LET)","v":"AO"},{"$f":"+LOOKUP(AR5,VCOL_NR,VCOL_LET)","v":"AR"},"s",{"$f":"+AP3","v":"2001-01-01"},{"$f":"+AP4","v":"2021-12-01"},"- JUROS REM FGTS-5% (índices cadastrados de jan-2001 até dez-2021)","Correção monetária pelos índices remuneratórios do FGTS (5%).",null,15,"O",null,null,null,null,null,"1997-03-01",5.0000000000000001E-3,null,"1997-03-01",1.6400000000000001E-2,"1997-03-01","1997-03-01",1.6400000000000001E-2,null,"1997-03-01","1997-03-01","","","",1.6400000000000001E-2,1.6400000000000001E-2,3.1479999999999992,null,null,null,null,null,null,null,null,null,null,null,"",null,"2002-03-01",4.0000000000000001E-3,null,"2002-03-01",6.7667899999999115E-3]
[null,"2001-04-01",180,"2001-04-01",180,null,"2002-04-01",7.7999999999999996E-3,"2002-04-01",7.7999999999999996E-3,null,"2002-04-01",8.0000000000000002E-3,"2002-04-01",8.0000000000000002E-3,null,"2002-04-01",2.3570000000000002E-3,"2002-04-01",2.3570000000000002E-3,null,"2007-12-01",9.7000000000000003E-3,"2007-12-01",9.7000000000000003E-3,null,null,null,null,null,null,"1997-04-01",8.6920000000000001E-3,9.5049999999999996E-3,1.031E-2,1.1108E-2,null,"2002-04-01",7.7999999999999996E-3,null,"2002-04-01",2.4659999999999999E-3,3.2729999999999999E-3,4.0740000000000004E-3,4.8669999999999998E-3,null,24,{"$error":"#REF!"},{"$error":"#REF!"},{"$error":"#REF!"},{"$error":"#REF!"},{"$error":"#REF!"},null,16,16,{"$f":"+IF(BG24=\"N\",\"\",\"IPCA\")","v":"IPCA"},{"$f":"+LOOKUP(N5,VCOL_NR,VCOL_LET)","v":"N"},{"$f":"+LOOKUP(O5,VCOL_NR,VCOL_LET)","v":"O"},"s",{"$f":"+M3","v":"2001-01-01"},{"$f":"+M4","v":"2021-04-01"},"- IPCA (índices cadastrados de jan-2001 até abr-2021)","Correção monetária pelo IPCA.",null,16,"P",null,null,null,null,null,"1997-04-01",5.0000000000000001E-3,null,"1997-04-01",1.66E-2,"1997-04-01","1997-04-01",1.66E-2,null,"1997-04-01","1997-04-01","","","",1.66E-2,1.66E-2,3.1313999999999993,null,null,null,null,null,null,null,null,null,null,null,"",null,"2002-04-01",7.7999999999999996E-3,null,"2002-04-01",7.3687849999999333E-3]
[null,"2001-05-01",180,"2001-05-01",180,null,"2002-05-01",4.1999999999999997E-3,"2002-05-01",4.1999999999999997E-3,null,"2002-05-01",2.0999999999999999E-3,"2002-05-01",2.0999999999999999E-3,null,"2002-05-01",2.1020000000000001E-3,"2002-05-01",2.1020000000000001E-3,null,"2008-01-01",6.8999999999999999E-3,"2008-01-01",6.8999999999999999E-3,null,null,null,null,null,null,"1997-05-01",8.8350000000000008E-3,9.6480000000000003E-3,1.0454E-2,1.1252E-2,null,"2002-05-01",4.1999999999999997E-3,null,"2002-05-01",2.4659999999999999E-3,3.2729999999999999E-3,4.0740000000000004E-3,4.8669999999999998E-3,null,25,{"$error":"#REF!"},{"$error":"#REF!"},{"$error":"#REF!"},{"$error":"#REF!"},{"$error":"#REF!"},null,17,17,null,null,null,null,null,null,null,null,null,17,"Q",null,null,null,null,null,"1997-05-01",5.0000000000000001E-3,null,"1997-05-01",1.5800000000000002E-2,"1997-05-01","1997-05-01",1.5800000000000002E-2,null,"1997-05-01","1997-05-01","","","",1.5800000000000002E-2,1.5800000000000002E-2,3.1155999999999993,null,null,null,null,null,null,null,null,null,null,null,"",null,"2002-05-01",4.1999999999999997E-3,null,"2002-05-01",7.1125100000000163E-3]
[null,"2001-06-01",180,"2001-06-01",180,null,"2002-06-01",3.3E-3,"2002-06-01",3.3E-3,null,"2002-06-01",4.1999999999999997E-3,"2002-06-01",4.1999999999999997E-3,null,"2002-06-01",1.5820000000000001E-3,"2002-06-01",1.5820000000000001E-3,null,"2008-02-01",4.7999999999999996E-3,"2008-02-01",4.7999999999999996E-3,null,null,null,null,null,null,"1997-06-01",9.0170000000000007E-3,9.8300000000000002E-3,1.0635E-2,1.1434E-2,null,"2002-06-01",3.3E-3,null,"2002-06-01",2.4659999999999999E-3,3.2729999999999999E-3,4.0740000000000004E-3,4.8669999999999998E-3,null,26,{"$error":"#REF!"},{"$error":"#REF!"},{"$error":"#REF!"},{"$error":"#REF!"},{"$error":"#REF!"},null,18,0,{"$f":"+IF(BG26=\"N\",\"\",\"Sem correção monetária\")","v":"Sem correção monetária"},null,null,"s","2001-01-01",{"$f":"+NOW()","v":"2021-12-07T09:37:51.890"},{"$f":"+IF(BG26=\"N\",\"\",CONCATENATE(\"- \",BD26))","v":"- Sem correção monetária"},"Sem correção monetária",null,18,"R",null,null,null,null,null,"1997-06-01",5.0000000000000001E-3,null,"1997-06-01",1.61E-2,"1997-06-01","1997-06-01",1.61E-2,null,"1997-06-01","1997-06-01","","","",1.61E-2,1.61E-2,3.0994999999999995,null,null,null,null,null,null,null,null,null,null,null,"",null,"2002-06-01",3.3E-3,null,"2002-06-01",6.5899099999997546E-3]
[null,"2001-07-01",180,"2001-07-01",180,null,"2002-07-01",7.7000000000000002E-3,"2002-07-01",7.7000000000000002E-3,null,"2002-07-01",1.1900000000000001E-2,"2002-07-01",1.1900000000000001E-2,null,"2002-07-01",2.6559999999999999E-3,"2002-07-01",2.6559999999999999E-3,null,"2008-03-01",5.1000000000000004E-3,"2008-03-01",5.1000000000000004E-3,null,null,null,null,null,null,"1997-07-01",9.0620000000000006E-3,9.8750000000000001E-3,1.068E-2,1.1479E-2,null,"2002-07-01",7.7000000000000002E-3,null,"2002-07-01",2.4659999999999999E-3,3.2729999999999999E-3,4.0740000000000004E-3,4.8669999999999998E-3,null,27,{"$error":"#REF!"},{"$error":"#REF!"},{"$error":"#REF!"},{"$error":"#REF!"},{"$error":"#REF!"},null,null,null,null,null,null,null,null,null,null,null,null,19,"S",null,null,null,null,null,"1997-07-01",5.0000000000000001E-3,null,"1997-07-01",1.6E-2,"1997-07-01","1997-07-01",1.6E-2,null,"1997-07-01","1997-07-01","","","",1.6E-2,1.6E-2,3.0834999999999995,null,null,null,null,null,null,null,null,null,null,null,"",null,"2002-07-01",7.7000000000000002E-3,null,"2002-07-01",7.6692799999997785E-3]
[null,"2001-08-01",180,"2001-08-01",180,null,"2002-08-01",0.01,"2002-08-01",0.01,null,"2002-08-01",6.4999999999999997E-3,"2002-08-01",6.4999999999999997E-3,null,"2002-08-01",2.4810000000000001E-3,"2002-08-01",2.4810000000000001E-3,null,"2008-04-01",6.4000000000000003E-3,"2008-04-01",6.4000000000000003E-3,null,null,null,null,null,null,"1997-08-01",8.7510000000000001E-3,9.5639999999999996E-3,1.0369E-2,1.1168000000000001E-2,null,"2002-08-01",0.01,null,"2002-08-01",2.4659999999999999E-3,3.2729999999999999E-3,4.0740000000000004E-3,4.8669999999999998E-3,null,28,{"$error":"#REF!"},{"$error":"#REF!"},{"$error":"#REF!"},{"$error":"#REF!"},{"$error":"#REF!"},null,null,null,null,null,null,null,null,null,null,null,null,20,"T",null,null,null,null,null,"1997-08-01",5.0000000000000001E-3,null,"1997-08-01",1.5900000000000001E-2,"1997-08-01","1997-08-01",1.5900000000000001E-2,null,"1997-08-01","1997-08-01","","","",1.5900000000000001E-2,1.5900000000000001E-2,3.0675999999999997,null,null,null,null,null,null,null,null,null,null,null,"",null,"2002-08-01",0.01,null,"2002-08-01",7.493404999999953E-3]
[null,"2001-09-01",180,"2001-09-01",180,null,"2002-09-01",6.1999999999999998E-3,"2002-09-01",6.1999999999999998E-3,null,"2002-09-01",7.1999999999999998E-3,"2002-09-01",7.1999999999999998E-3,null,"2002-09-01",1.9550000000000001E-3,"2002-09-01",1.9550000000000001E-3,null,"2008-05-01",9.5999999999999992E-3,"2008-05-01",9.5999999999999992E-3,null,null,null,null,null,null,"1997-09-01",8.9560000000000004E-3,9.7680000000000006E-3,1.0574E-2,1.1372999999999999E-2,null,"2002-09-01",6.1999999999999998E-3,null,"2002-09-01",2.4659999999999999E-3,3.2729999999999999E-3,4.0740000000000004E-3,4.8669999999999998E-3,null,29,{"$error":"#REF!"},{"$error":"#REF!"},{"$error":"#REF!"},{"$error":"#REF!"},{"$error":"#REF!"},null,null,null,null,null,null,null,"ÍNDICE SELECIONADO",null,null,null,null,21,"U",null,null,null,null,null,"1997-09-01",5.0000000000000001E-3,null,"1997-09-01",1.5900000000000001E-2,"1997-09-01","1997-09-01",1.5900000000000001E-2,null,"1997-09-01","1997-09-01","","","",1.5900000000000001E-2,1.5900000000000001E-2,3.0516999999999999,null,null,null,null,null,null,null,null,null,null,null,"",null,"2002-09-01",6.1999999999999998E-3,null,"2002-09-01",6.9647749999999231E-3]
[null,"2001-10-01",180,"2001-10-01",180,null,"2002-10-01",8.9999999999999993E-3,"2002-10-01",8.9999999999999993E-3,null,"2002-10-01",1.3100000000000001E-2,"2002-10-01",1.3100000000000001E-2,null,"2002-10-01",2.7680000000000001E-3,"2002-10-01",2.7680000000000001E-3,null,"2008-06-01",9.1000000000000004E-3,"2008-06-01",9.1000000000000004E-3,null,null,null,null,null,null,"1997-10-01",9.0349999999999996E-3,9.8480000000000009E-3,1.0652999999999999E-2,1.1452E-2,null,"2002-10-01",8.9999999999999993E-3,null,"2002-10-01",2.4659999999999999E-3,3.2729999999999999E-3,4.0740000000000004E-3,4.8669999999999998E-3,null,30,{"$error":"#REF!"},{"$error":"#REF!"},{"$error":"#REF!"},{"$error":"#REF!"},{"$error":"#REF!"},null,null,null,null,null,null,null,"VLET_DT",{"$f":"+IF(COD_CM=0,\"\",LOOKUP(MATCH(COD_CM,BC9:BC26,0),BB9:BB26,BE9:BE26))","v":""},null,null,null,22,"V",null,null,null,null,null,"1997-10-01",5.0000000000000001E-3,null,"1997-10-01",1.67E-2,"1997-10-01","1997-10-01",1.67E-2,null,"1997-10-01","1997-10-01","","","",1.67E-2,1.67E-2,3.0349999999999997,null,null,null,null,null,null,null,null,null,null,null,"",null,"2002-10-01",8.9999999999999993E-3,null,"2002-10-01",7.7818400000000398E-3]
[null,"2001-11-01",180,"2001-11-01",180,null,"2002-11-01",2.0799999999999999E-2,"2002-11-01",2.0799999999999999E-2,null,"2002-11-01",3.0200000000000001E-2,"2002-11-01",3.0200000000000001E-2,null,"2002-11-01",2.6440000000000001E-3,"2002-11-01",2.6440000000000001E-3,null,"2008-07-01",5.7999999999999996E-3,"2008-07-01",5.7999999999999996E-3,null,null,null,null,null,null,"1997-11-01",1.7838E-2,1.8657E-2,1.9470000000000001E-2,2.0275999999999999E-2,null,"2002-11-01",2.0799999999999999E-2,null,"2002-11-01",2.4659999999999999E-3,3.2729999999999999E-3,4.0740000000000004E-3,4.8669999999999998E-3,null,31,{"$error":"#REF!"},{"$error":"#REF!"},{"$error":"#REF!"},{"$error":"#REF!"},{"$error":"#REF!"},null,null,null,null,null,null,null,"VLET_COT",{"$f":"+IF(COD_CM=0,\"\",LOOKUP(MATCH(COD_CM,BC9:BC26,0),BB9:BB26,BF9:BF26))","v":""},null,null,null,23,"W",null,null,null,null,null,"1997-11-01",5.0000000000000001E-3,null,"1997-11-01",3.04E-2,"1997-11-01","1997-11-01",3.04E-2,null,"1997-11-01","1997-11-01","","","",3.04E-2,3.04E-2,3.0045999999999995,null,null,null,null,null,null,null,null,null,null,null,"",null,"2002-11-01",2.0799999999999999E-2,null,"2002-11-01",7.6572200000000201E-3]
[null,"2001-12-01",180,"2001-12-01",180,null,"2002-12-01",3.0499999999999999E-2,"2002-12-01",3.0499999999999999E-2,null,"2002-12-01",2.1000000000000001E-2,"2002-12-01",2.1000000000000001E-2,null,"2002-12-01",3.6089999999999998E-3,"2002-12-01",3.6089999999999998E-3,null,"2008-08-01",2.0999999999999999E-3,"2008-08-01",2.0999999999999999E-3,null,null,null,null,null,null,"1997-12-01",1.5583E-2,1.6400999999999999E-2,1.7212000000000002E-2,1.8016000000000001E-2,null,"2002-12-01",3.0499999999999999E-2,null,"2002-12-01",2.4659999999999999E-3,3.2729999999999999E-3,4.0740000000000004E-3,4.8669999999999998E-3,null,32,{"$error":"#REF!"},{"$error":"#REF!"},{"$error":"#REF!"},{"$error":"#REF!"},{"$error":"#REF!"},null,null,null,null,null,null,null,"VDAT_MIN",{"$f":"+IF(COD_CM=0,\"\",LOOKUP(MATCH(COD_CM,BC9:BC26,0),BB9:BB26,BH9:BH26))","v":""},null,null,null,24,"X",null,null,null,null,null,"1997-12-01",5.0000000000000001E-3,null,"1997-12-01",2.9700000000000001E-2,"1997-12-01","1997-12-01",2.9700000000000001E-2,null,"1997-12-01","1997-12-01","","","",2.9700000000000001E-2,2.9700000000000001E-2,2.9748999999999994,null,null,null,null,null,null,null,null,null,null,null,"",null,"2002-12-01",3.0499999999999999E-2,null,"2002-12-01",8.6270449999998888E-3]
[null,"2002-01-01",180,"2002-01-01",180,null,"2003-01-01",1.9800000000000002E-2,"2003-01-01",1.9800000000000002E-2,null,"2003-01-01",2.2499999999999999E-2,"2003-01-01",2.2499999999999999E-2,null,"2003-01-01",4.8780000000000004E-3,"2003-01-01",4.8780000000000004E-3,null,"2008-09-01",1.5E-3,"2008-09-01",1.5E-3,null,null,null,null,null,null,"1998-01-01",1.3953E-2,1.477E-2,1.5579000000000001E-2,1.6382000000000001E-2,null,"2003-01-01",1.9800000000000002E-2,null,"2003-01-01",2.4659999999999999E-3,3.2729999999999999E-3,4.0740000000000004E-3,4.8669999999999998E-3,null,33,{"$error":"#REF!"},{"$error":"#REF!"},{"$error":"#REF!"},{"$error":"#REF!"},{"$error":"#REF!"},null,null,null,null,null,null,null,"VDAT_MAX",{"$f":"+IF(COD_CM=0,\"\",LOOKUP(MATCH(COD_CM,BC9:BC26,0),BB9:BB26,BI9:BI26))","v":""},null,null,null,25,"Y",null,null,null,null,null,"1998-01-01",5.0000000000000001E-3,null,"1998-01-01",2.6700000000000002E-2,"1998-01-01","1998-01-01",2.6700000000000002E-2,null,"1998-01-01","1998-01-01","","","",2.6700000000000002E-2,2.6700000000000002E-2,2.9481999999999995,null,null,null,null,null,null,null,null,null,null,null,"",null,"2003-01-01",1.9800000000000002E-2,null,"2003-01-01",9.9023899999999276E-3]
[null,"2002-02-01",180,"2002-02-01",180,null,"2003-02-01",2.1899999999999999E-2,"2003-02-01",2.1899999999999999E-2,null,"2003-02-01",1.5699999999999999E-2,"2003-02-01",1.5699999999999999E-2,null,"2003-02-01",4.1159999999999999E-3,"2003-02-01",4.1159999999999999E-3,null,"2008-10-01",5.0000000000000001E-3,"2008-10-01",5.0000000000000001E-3,null,null,null,null,null,null,"1998-02-01",6.9379999999999997E-3,7.7489999999999998E-3,8.5529999999999998E-3,9.3500000000000007E-3,null,"2003-02-01",2.1899999999999999E-2,null,"2003-02-01",2.4659999999999999E-3,3.2729999999999999E-3,4.0740000000000004E-3,4.8669999999999998E-3,null,34,{"$error":"#REF!"},{"$error":"#REF!"},{"$error":"#REF!"},{"$error":"#REF!"},{"$error":"#REF!"},null,null,null,null,null,null,null,null,null,null,null,null,26,"Z",null,null,null,null,null,"1998-02-01",5.0000000000000001E-3,null,"1998-02-01",2.1299999999999999E-2,"1998-02-01","1998-02-01",2.1299999999999999E-2,null,"1998-02-01","1998-02-01","","","",2.1299999999999999E-2,2.1299999999999999E-2,2.9268999999999994,null,null,null,null,null,null,null,null,null,null,null,"",null,"2003-02-01",2.1899999999999999E-2,null,"2003-02-01",9.1365799999998387E-3]
[null,"2002-03-01",180,"2002-03-01",180,null,"2003-03-01",1.14E-2,"2003-03-01",1.14E-2,null,"2003-03-01",1.23E-2,"2003-03-01",1.23E-2,null,"2003-03-01",3.7820000000000002E-3,"2003-03-01",3.7820000000000002E-3,null,"2008-11-01",3.8E-3,"2008-11-01",3.8E-3,null,null,null,null,null,null,"1998-03-01",1.1483E-2,1.2298E-2,1.3105E-2,1.3906E-2,null,"2003-03-01",1.14E-2,null,"2003-03-01",2.4659999999999999E-3,3.2729999999999999E-3,4.0740000000000004E-3,4.8669999999999998E-3,null,35,{"$error":"#REF!"},{"$error":"#REF!"},{"$error":"#REF!"},{"$error":"#REF!"},{"$error":"#REF!"},null,null,null,null,null,null,null,"COD_VER","2604201-6",null,null,null,27,"AA",null,null,null,null,null,"1998-03-01",5.0000000000000001E-3,null,"1998-03-01",2.1999999999999999E-2,"1998-03-01","1998-03-01",2.1999999999999999E-2,null,"1998-03-01","1998-03-01","","","",2.1999999999999999E-2,2.1999999999999999E-2,2.9048999999999996,null,null,null,null,null,null,null,null,null,null,null,"",null,"2003-03-01",1.14E-2,null,"2003-03-01",8.8009099999999396E-3]
[null,"2002-04-01",200,"2002-04-01",200,null,"2003-04-01",1.14E-2,"2003-04-01",1.14E-2,null,"2003-04-01",9.7000000000000003E-3,"2003-04-01",9.7000000000000003E-3,null,"2003-04-01",4.1840000000000002E-3,"2003-04-01",4.1840000000000002E-3,null,"2008-12-01",2.8999999999999998E-3,"2008-12-01",2.8999999999999998E-3,null,null,null,null,null,null,"1998-04-01",7.1970000000000003E-3,8.0090000000000005E-3,8.8129999999999997E-3,9.6100000000000005E-3,null,"2003-04-01",1.14E-2,null,"2003-04-01",2.4659999999999999E-3,3.2729999999999999E-3,4.0740000000000004E-3,4.8669999999999998E-3,null,36,{"$error":"#REF!"},{"$error":"#REF!"},{"$error":"#REF!"},{"$error":"#REF!"},{"$error":"#REF!"},null,null,null,null,null,null,null,null,null,null,null,null,28,"AB",null,null,null,null,null,"1998-04-01",5.0000000000000001E-3,null,"1998-04-01",1.7100000000000001E-2,"1998-04-01","1998-04-01",1.7100000000000001E-2,null,"1998-04-01","1998-04-01","","","",1.7100000000000001E-2,1.7100000000000001E-2,2.8877999999999995,null,null,null,null,null,null,null,null,null,null,null,"",null,"2003-04-01",1.14E-2,null,"2003-04-01",9.2049199999999498E-3]
[null,"2002-05-01",200,"2002-05-01",200,null,"2003-05-01",8.5000000000000006E-3,"2003-05-01",8.5000000000000006E-3,null,"2003-05-01",6.1000000000000004E-3,"2003-05-01",6.1000000000000004E-3,null,"2003-05-01",4.6499999999999996E-3,"2003-05-01",4.6499999999999996E-3,null,"2009-01-01",6.4000000000000003E-3,"2009-01-01",6.4000000000000003E-3,null,null,null,null,null,null,"1998-05-01",7.0200000000000002E-3,7.8309999999999994E-3,8.6350000000000003E-3,9.4319999999999994E-3,null,"2003-05-01",8.5000000000000006E-3,null,"2003-05-01",2.4659999999999999E-3,3.2729999999999999E-3,4.0740000000000004E-3,4.8669999999999998E-3,null,37,{"$error":"#REF!"},{"$error":"#REF!"},{"$error":"#REF!"},{"$error":"#REF!"},{"$error":"#REF!"},null,null,null,null,null,null,null,"VMES99",{"$f":"+EOMONTH(TRUNC(NOW(),0),-1)+1","v":"2021-12-01"},null,null,null,29,"AC",null,null,null,null,null,"1998-05-01",5.0000000000000001E-3,null,"1998-05-01",1.6299999999999999E-2,"1998-05-01","1998-05-01",1.6299999999999999E-2,null,"1998-05-01","1998-05-01","","","",1.6299999999999999E-2,1.6299999999999999E-2,2.8714999999999993,null,null,null,null,null,null,null,null,null,null,null,"",null,"2003-05-01",8.5000000000000006E-3,null,"2003-05-01",9.6732499999998556E-3]
[null,"2002-06-01",200,"2002-06-01",200,null,"2003-06-01",2.2000000000000001E-3,"2003-06-01",2.2000000000000001E-3,null,"2003-06-01",-1.5E-3,"2003-06-01",-1.5E-3,null,"2003-06-01",4.1660000000000004E-3,"2003-06-01",4.1660000000000004E-3,null,"2009-02-01",3.0999999999999999E-3,"2009-02-01",3.0999999999999999E-3,null,null,null,null,null,null,"1998-06-01",7.391E-3,8.2019999999999992E-3,9.0069999999999994E-3,9.8040000000000002E-3,null,"2003-06-01",2.2000000000000001E-3,null,"2003-06-01",2.4659999999999999E-3,3.2729999999999999E-3,4.0740000000000004E-3,4.8669999999999998E-3,null,38,{"$error":"#REF!"},{"$error":"#REF!"},{"$error":"#REF!"},{"$error":"#REF!"},{"$error":"#REF!"},null,null,null,null,null,null,null,null,null,null,null,null,30,"AD",null,null,null,null,null,"1998-06-01",5.0000000000000001E-3,null,"1998-06-01",1.6E-2,"1998-06-01","1998-06-01",1.6E-2,null,"1998-06-01","1998-06-01","","","",1.6E-2,1.6E-2,2.8554999999999993,null,null,null,null,null,null,null,null,null,null,null,"",null,"2003-06-01",2.2000000000000001E-3,null,"2003-06-01",9.1868299999997571E-3]
[null,"2002-07-01",200,"2002-07-01",200,null,"2003-07-01",-1.8E-3,"2003-07-01",-1.8E-3,null,"2003-07-01",2E-3,"2003-07-01",2E-3,null,"2003-07-01",5.4650000000000002E-3,"2003-07-01",5.4650000000000002E-3,null,"2009-03-01",2E-3,"2009-03-01",2E-3,null,null,null,null,null,null,"1998-07-01",7.9819999999999995E-3,8.7939999999999997E-3,9.5989999999999999E-3,1.0397E-2,null,"2003-07-01",-1.8E-3,null,"2003-07-01",2.4659999999999999E-3,3.2729999999999999E-3,4.0740000000000004E-3,4.8669999999999998E-3,null,39,{"$error":"#REF!"},{"$error":"#REF!"},{"$error":"#REF!"},{"$error":"#REF!"},{"$error":"#REF!"},null,null,null,null,null,null,null,null,null,null,null,null,31,"AE",null,null,null,null,null,"1998-07-01",5.0000000000000001E-3,null,"1998-07-01",1.7000000000000001E-2,"1998-07-01","1998-07-01",1.7000000000000001E-2,null,"1998-07-01","1998-07-01","","","",1.7000000000000001E-2,1.7000000000000001E-2,2.8384999999999994,null,null,null,null,null,null,null,null,null,null,null,"",null,"2003-07-01",-1.8E-3,null,"2003-07-01",1.0492324999999969E-2]
[null,"2002-08-01",200,"2002-08-01",200,null,"2003-08-01",2.7000000000000001E-3,"2003-08-01",2.7000000000000001E-3,null,"2003-08-01",3.3999999999999998E-3,"2003-08-01",3.3999999999999998E-3,null,"2003-08-01",4.0379999999999999E-3,"2003-08-01",4.0379999999999999E-3,null,"2009-04-01",5.4999999999999997E-3,"2009-04-01",5.4999999999999997E-3,null,null,null,null,null,null,"1998-08-01",6.2240000000000004E-3,7.0349999999999996E-3,7.8379999999999995E-3,8.6339999999999993E-3,null,"2003-08-01",2.7000000000000001E-3,null,"2003-08-01",2.4659999999999999E-3,3.2729999999999999E-3,4.0740000000000004E-3,4.8669999999999998E-3,null,40,{"$error":"#REF!"},{"$error":"#REF!"},{"$error":"#REF!"},{"$error":"#REF!"},{"$error":"#REF!"},null,null,null,null,null,null,null,null,null,null,null,null,32,"AF",null,null,null,null,null,"1998-08-01",5.0000000000000001E-3,null,"1998-08-01",1.4800000000000001E-2,"1998-08-01","1998-08-01",1.4800000000000001E-2,null,"1998-08-01","1998-08-01","","","",1.4800000000000001E-2,1.4800000000000001E-2,2.8236999999999992,null,null,null,null,null,null,null,null,null,null,null,"",null,"2003-08-01",2.7000000000000001E-3,null,"2003-08-01",9.058189999999966E-3]
[null,"2002-09-01",200,"2002-09-01",200,null,"2003-09-01",5.7000000000000002E-3,"2003-09-01",5.7000000000000002E-3,null,"2003-09-01",7.7999999999999996E-3,"2003-09-01",7.7999999999999996E-3,null,"2003-09-01",3.3639999999999998E-3,"2003-09-01",3.3639999999999998E-3,null,"2009-05-01",6.0000000000000001E-3,"2009-05-01",6.0000000000000001E-3,null,null,null,null,null,null,"1998-09-01",6.9890000000000004E-3,7.7999999999999996E-3,8.6040000000000005E-3,9.4009999999999996E-3,null,{"$f":"+I41","v":"2003-09-01"},{"$f":"+J41","v":5.7000000000000002E-3},null,"2003-09-01",2.4659999999999999E-3,3.2729999999999999E-3,4.0740000000000004E-3,4.8669999999999998E-3,null,41,{"$error":"#REF!"},{"$error":"#REF!"},{"$error":"#REF!"},{"$error":"#REF!"},{"$error":"#REF!"},null,null,null,null,null,null,null,null,null,null,null,null,33,"AG",null,null,null,null,null,"1998-09-01",5.0000000000000001E-3,null,"1998-09-01",2.4899999999999999E-2,"1998-09-01","1998-09-01",2.4899999999999999E-2,null,"1998-09-01","1998-09-01","","",{"$f":"+IF(OR(COD_JUROS<>3,CD41=\"\"),\"\",0.5%)","v":""},2.4899999999999999E-2,2.4899999999999999E-2,2.7987999999999991,null,null,null,null,null,null,null,null,null,null,null,"",null,{"$f":"+I41","v":"2003-09-01"},{"$f":"+J41","v":5.7000000000000002E-3},null,"2003-09-01",8.3808199999997335E-3]
[null,"2002-10-01",200,"2002-10-01",200,null,"2003-10-01",6.6E-3,"2003-10-01",6.6E-3,null,"2003-10-01",2.8999999999999998E-3,"2003-10-01",2.8999999999999998E-3,null,"2003-10-01",3.2130000000000001E-3,"2003-10-01",3.2130000000000001E-3,null,"2009-06-01",4.1999999999999997E-3,"2009-06-01",4.1999999999999997E-3,null,null,null,null,null,null,"1998-10-01",1.1379999999999999E-2,1.2194E-2,1.3002E-2,1.3802E-2,null,"2003-10-01",6.6E-3,null,"2003-10-01",2.4659999999999999E-3,3.2729999999999999E-3,4.0740000000000004E-3,4.8669999999999998E-3,null,42,{"$error":"#REF!"},{"$error":"#REF!"},{"$error":"#REF!"},{"$error":"#REF!"},{"$error":"#REF!"},null,null,null,null,null,null,null,null,null,null,null,null,34,"AH",null,null,null,null,null,"1998-10-01",5.0000000000000001E-3,null,"1998-10-01",2.9399999999999999E-2,"1998-10-01","1998-10-01",2.9399999999999999E-2,null,"1998-10-01","1998-10-01","","","",2.9399999999999999E-2,2.9399999999999999E-2,2.7693999999999992,null,null,null,null,null,null,null,null,null,null,null,"",null,"2003-10-01",6.6E-3,null,"2003-10-01",8.2290649999998688E-3]
[null,"2002-11-01",200,"2002-11-01",200,null,"2003-11-01",1.6999999999999999E-3,"2003-11-01",1.6999999999999999E-3,null,"2003-11-01",3.3999999999999998E-3,"2003-11-01",3.3999999999999998E-3,null,"2003-11-01",1.776E-3,"2003-11-01",1.776E-3,null,"2009-07-01",2.3E-3,"2009-07-01",2.3E-3,null,null,null,null,null,null,"1998-11-01",8.6169999999999997E-3,9.4289999999999999E-3,1.0234999999999999E-2,1.1032999999999999E-2,null,"2003-11-01",1.6999999999999999E-3,null,"2003-11-01",2.4659999999999999E-3,3.2729999999999999E-3,4.0740000000000004E-3,4.8669999999999998E-3,null,43,{"$error":"#REF!"},{"$error":"#REF!"},{"$error":"#REF!"},{"$error":"#REF!"},{"$error":"#REF!"},null,null,null,null,null,null,null,null,null,null,null,null,35,"AI",null,null,null,null,null,"1998-11-01",5.0000000000000001E-3,null,"1998-11-01",2.63E-2,"1998-11-01","1998-11-01",2.63E-2,null,"1998-11-01","1998-11-01","","","",2.63E-2,2.63E-2,2.7430999999999992,null,null,null,null,null,null,null,null,null,null,null,"",null,"2003-11-01",1.6999999999999999E-3,null,"2003-11-01",6.7848799999998821E-3]
[null,"2002-12-01",200,"2002-12-01",200,null,"2003-12-01",4.5999999999999999E-3,"2003-12-01",4.5999999999999999E-3,null,"2003-12-01",5.1999999999999998E-3,"2003-12-01",5.1999999999999998E-3,null,"2003-12-01",1.8990000000000001E-3,"2003-12-01",1.8990000000000001E-3,null,"2009-08-01",8.0000000000000004E-4,"2009-08-01",8.0000000000000004E-4,null,null,null,null,null,null,"1998-12-01",9.9179999999999997E-3,1.0732E-2,1.1538E-2,1.2337000000000001E-2,null,"2003-12-01",4.5999999999999999E-3,null,"2003-12-01",2.4659999999999999E-3,3.2729999999999999E-3,4.0740000000000004E-3,4.8669999999999998E-3,null,44,{"$error":"#REF!"},{"$error":"#REF!"},{"$error":"#REF!"},{"$error":"#REF!"},{"$error":"#REF!"},null,null,null,null,null,null,null,null,null,null,null,null,36,"AJ",null,null,null,null,null,"1998-12-01",5.0000000000000001E-3,null,"1998-12-01",2.4E-2,"1998-12-01","1998-12-01",2.4E-2,null,"1998-12-01","1998-12-01","","","",2.4E-2,2.4E-2,2.7190999999999992,null,null,null,null,null,null,null,null,null,null,null,"",null,"2003-12-01",4.5999999999999999E-3,null,"2003-12-01",6.9084950000000145E-3]
[null,"2003-01-01",200,"2003-01-01",200,null,"2004-01-01",6.7999999999999996E-3,"2004-01-01",6.7999999999999996E-3,null,"2004-01-01",7.6E-3,"2004-01-01",7.6E-3,null,"2004-01-01",1.2800000000000001E-3,"2004-01-01",1.2800000000000001E-3,null,"2009-09-01",1.6000000000000001E-3,"2009-09-01",1.6000000000000001E-3,null,null,null,null,null,null,"1999-01-01",7.6410000000000002E-3,8.4530000000000004E-3,9.2580000000000006E-3,1.0055E-2,null,"2004-01-01",6.7999999999999996E-3,null,"2004-01-01",2.4659999999999999E-3,3.2729999999999999E-3,4.0740000000000004E-3,4.8669999999999998E-3,null,45,{"$error":"#REF!"},{"$error":"#REF!"},{"$error":"#REF!"},{"$error":"#REF!"},{"$error":"#REF!"},null,null,null,null,null,null,null,null,null,null,null,null,37,"AK",null,null,null,null,null,"1999-01-01",5.0000000000000001E-3,null,"1999-01-01",2.18E-2,"1999-01-01","1999-01-01",2.18E-2,null,"1999-01-01","1999-01-01","","","",2.18E-2,2.18E-2,2.6972999999999994,null,null,null,null,null,null,null,null,null,null,null,"",null,"2004-01-01",6.7999999999999996E-3,null,"2004-01-01",6.2863999999998033E-3]
[null,"2003-02-01",200,"2003-02-01",200,null,"2004-02-01",8.9999999999999993E-3,"2004-02-01",8.9999999999999993E-3,null,"2004-02-01",6.1000000000000004E-3,"2004-02-01",6.1000000000000004E-3,null,"2004-02-01",4.5800000000000002E-4,"2004-02-01",4.5800000000000002E-4,null,"2009-10-01",2.3999999999999998E-3,"2009-10-01",2.3999999999999998E-3,null,null,null,null,null,null,"1999-02-01",1.0784E-2,1.1598000000000001E-2,1.2404999999999999E-2,1.3205E-2,null,"2004-02-01",8.9999999999999993E-3,null,"2004-02-01",2.4659999999999999E-3,3.2729999999999999E-3,4.0740000000000004E-3,4.8669999999999998E-3,null,46,{"$error":"#REF!"},{"$error":"#REF!"},{"$error":"#REF!"},{"$error":"#REF!"},{"$error":"#REF!"},null,null,null,null,null,null,null,null,null,null,null,null,38,"AL",null,null,null,null,null,"1999-02-01",5.0000000000000001E-3,null,"1999-02-01",2.3800000000000002E-2,"1999-02-01","1999-02-01",2.3800000000000002E-2,null,"1999-02-01","1999-02-01","","","",2.3800000000000002E-2,2.3800000000000002E-2,2.6734999999999993,null,null,null,null,null,null,null,null,null,null,null,"",null,"2004-02-01",8.9999999999999993E-3,null,"2004-02-01",5.4602900000000343E-3]
[null,"2003-03-01",200,"2003-03-01",200,null,"2004-03-01",4.0000000000000001E-3,"2004-03-01",4.0000000000000001E-3,null,"2004-03-01",4.7000000000000002E-3,"2004-03-01",4.7000000000000002E-3,null,"2004-03-01",1.7780000000000001E-3,"2004-03-01",1.7780000000000001E-3,null,"2009-11-01",3.7000000000000002E-3,"2009-11-01",3.7000000000000002E-3,null,null,null,null,null,null,"1999-03-01",1.4108000000000001E-2,1.4925000000000001E-2,1.5734999999999999E-2,1.6538000000000001E-2,null,"2004-03-01",4.0000000000000001E-3,null,"2004-03-01",2.4659999999999999E-3,3.2729999999999999E-3,4.0740000000000004E-3,4.8669999999999998E-3,null,47,{"$error":"#REF!"},{"$error":"#REF!"},{"$error":"#REF!"},{"$error":"#REF!"},{"$error":"#REF!"},null,null,null,null,null,null,null,null,null,null,null,null,39,"AM",null,null,null,null,null,"1999-03-01",5.0000000000000001E-3,null,"1999-03-01",3.3300000000000003E-2,"1999-03-01","1999-03-01",3.3300000000000003E-2,null,"1999-03-01","1999-03-01","","","",3.3300000000000003E-2,3.3300000000000003E-2,2.6401999999999992,null,null,null,null,null,null,null,null,null,null,null,"",null,"2004-03-01",4.0000000000000001E-3,null,"2004-03-01",6.7868899999998789E-3]
[null,"2003-04-01",240,"2003-04-01",240,null,"2004-04-01",2.0999999999999999E-3,"2004-04-01",2.0999999999999999E-3,null,"2004-04-01",3.7000000000000002E-3,"2004-04-01",3.7000000000000002E-3,null,"2004-04-01",8.7399999999999999E-4,"2004-04-01",8.7399999999999999E-4,null,"2009-12-01",2.3999999999999998E-3,"2009-12-01",2.3999999999999998E-3,null,null,null,null,null,null,"1999-04-01",8.5730000000000008E-3,9.3849999999999992E-3,1.0189999999999999E-2,1.0989000000000001E-2,null,"2004-04-01",2.0999999999999999E-3,null,"2004-04-01",2.4659999999999999E-3,3.2729999999999999E-3,4.0740000000000004E-3,4.8669999999999998E-3,null,48,{"$error":"#REF!"},{"$error":"#REF!"},{"$error":"#REF!"},{"$error":"#REF!"},{"$error":"#REF!"},null,null,null,null,null,null,null,null,null,null,null,null,40,"AN",null,null,null,null,null,"1999-04-01",5.0000000000000001E-3,null,"1999-04-01",2.35E-2,"1999-04-01","1999-04-01",2.35E-2,null,"1999-04-01","1999-04-01","","","",2.35E-2,2.35E-2,2.6166999999999994,null,null,null,null,null,null,null,null,null,null,null,"",null,"2004-04-01",2.0999999999999999E-3,null,"2004-04-01",5.8783700000000216E-3]
[null,"2003-05-01",240,"2003-05-01",240,null,"2004-05-01",5.4000000000000003E-3,"2004-05-01",5.4000000000000003E-3,null,"2004-05-01",5.1000000000000004E-3,"2004-05-01",5.1000000000000004E-3,null,"2004-05-01",1.5460000000000001E-3,"2004-05-01",1.5460000000000001E-3,null,"2010-01-01",8.8000000000000005E-3,"2010-01-01",8.8000000000000005E-3,null,null,null,null,null,null,"1999-05-01",8.2410000000000001E-3,9.0530000000000003E-3,9.8580000000000004E-3,1.0656000000000001E-2,null,"2004-05-01",5.4000000000000003E-3,null,"2004-05-01",2.4659999999999999E-3,3.2729999999999999E-3,4.0740000000000004E-3,4.8669999999999998E-3,null,49,{"$error":"#REF!"},{"$error":"#REF!"},{"$error":"#REF!"},{"$error":"#REF!"},{"$error":"#REF!"},null,null,null,null,null,null,null,null,null,null,null,null,41,"AO",null,null,null,null,null,"1999-05-01",5.0000000000000001E-3,null,"1999-05-01",2.0199999999999999E-2,"1999-05-01","1999-05-01",2.0199999999999999E-2,null,"1999-05-01","1999-05-01","","","",2.0199999999999999E-2,2.0199999999999999E-2,2.5964999999999994,null,null,null,null,null,null,null,null,null,null,null,"",null,"2004-05-01",5.4000000000000003E-3,null,"2004-05-01",6.5537300000000354E-3]
[null,"2003-06-01",240,"2003-06-01",240,null,"2004-06-01",5.5999999999999999E-3,"2004-06-01",5.5999999999999999E-3,null,"2004-06-01",7.1000000000000004E-3,"2004-06-01",7.1000000000000004E-3,null,"2004-06-01",1.761E-3,"2004-06-01",1.761E-3,null,"2010-02-01",7.0000000000000001E-3,"2010-02-01",7.0000000000000001E-3,null,null,null,null,null,null,"1999-06-01",5.581E-3,6.391E-3,7.1939999999999999E-3,7.9900000000000006E-3,null,"2004-06-01",5.5999999999999999E-3,null,"2004-06-01",2.4659999999999999E-3,3.2729999999999999E-3,4.0740000000000004E-3,4.8669999999999998E-3,null,50,{"$error":"#REF!"},{"$error":"#REF!"},{"$error":"#REF!"},{"$error":"#REF!"},{"$error":"#REF!"},null,null,null,null,null,null,null,null,null,null,null,null,42,"AP",null,null,null,null,null,"1999-06-01",5.0000000000000001E-3,null,"1999-06-01",1.67E-2,"1999-06-01","1999-06-01",1.67E-2,null,"1999-06-01","1999-06-01","","","",1.67E-2,1.67E-2,2.5797999999999992,null,null,null,null,null,null,null,null,null,null,null,"",null,"2004-06-01",5.5999999999999999E-3,null,"2004-06-01",6.7698049999997956E-3]
[null,"2003-07-01",240,"2003-07-01",240,null,"2004-07-01",9.2999999999999992E-3,"2004-07-01",9.2999999999999992E-3,null,"2004-07-01",9.1000000000000004E-3,"2004-07-01",9.1000000000000004E-3,null,"2004-07-01",1.952E-3,"2004-07-01",1.952E-3,null,"2010-03-01",7.1000000000000004E-3,"2010-03-01",7.1000000000000004E-3,null,null,null,null,null,null,"1999-07-01",5.4060000000000002E-3,6.2160000000000002E-3,7.0190000000000001E-3,7.8139999999999998E-3,null,"2004-07-01",9.2999999999999992E-3,null,"2004-07-01",2.4659999999999999E-3,3.2729999999999999E-3,4.0740000000000004E-3,4.8669999999999998E-3,null,51,{"$error":"#REF!"},{"$error":"#REF!"},{"$error":"#REF!"},{"$error":"#REF!"},{"$error":"#REF!"},null,null,null,null,null,null,null,null,null,null,null,null,43,"AQ",null,null,null,null,null,"1999-07-01",5.0000000000000001E-3,null,"1999-07-01",1.66E-2,"1999-07-01","1999-07-01",1.66E-2,null,"1999-07-01","1999-07-01","","","",1.66E-2,1.66E-2,2.5631999999999993,null,null,null,null,null,null,null,null,null,null,null,"",null,"2004-07-01",9.2999999999999992E-3,null,"2004-07-01",6.961759999999817E-3]
[null,"2003-08-01",240,"2003-08-01",240,null,"2004-08-01",7.9000000000000008E-3,"2004-08-01",7.9000000000000008E-3,null,"2004-08-01",6.8999999999999999E-3,"2004-08-01",6.8999999999999999E-3,null,"2004-08-01",2.0049999999999998E-3,"2004-08-01",2.0049999999999998E-3,null,"2010-04-01",7.3000000000000001E-3,"2010-04-01",7.3000000000000001E-3,null,null,null,null,null,null,"1999-08-01",5.4180000000000001E-3,6.228E-3,7.0309999999999999E-3,7.8259999999999996E-3,null,"2004-08-01",7.9000000000000008E-3,null,"2004-08-01",2.4659999999999999E-3,3.2729999999999999E-3,4.0740000000000004E-3,4.8669999999999998E-3,null,52,{"$error":"#REF!"},{"$error":"#REF!"},{"$error":"#REF!"},{"$error":"#REF!"},{"$error":"#REF!"},null,null,null,null,null,null,null,null,null,null,null,null,44,"AR",null,null,null,null,null,"1999-08-01",5.0000000000000001E-3,null,"1999-08-01",1.5699999999999999E-2,"1999-08-01","1999-08-01",1.5699999999999999E-2,null,"1999-08-01","1999-08-01","","","",1.5699999999999999E-2,1.5699999999999999E-2,2.5474999999999994,null,null,null,null,null,null,null,null,null,null,null,"",null,"2004-08-01",7.9000000000000008E-3,null,"2004-08-01",7.0150249999998415E-3]
[null,"2003-09-01",240,"2003-09-01",240,null,"2004-09-01",4.8999999999999998E-3,"2004-09-01",4.8999999999999998E-3,null,"2004-09-01",3.3E-3,"2004-09-01",3.3E-3,null,"2004-09-01",1.7279999999999999E-3,"2004-09-01",1.7279999999999999E-3,null,"2010-05-01",4.3E-3,"2010-05-01",4.3E-3,null,null,null,null,null,null,"1999-09-01",5.1869999999999998E-3,5.9969999999999997E-3,6.7999999999999996E-3,7.5950000000000002E-3,null,"2004-09-01",4.8999999999999998E-3,null,"2004-09-01",2.4659999999999999E-3,3.2729999999999999E-3,4.0740000000000004E-3,4.8669999999999998E-3,null,53,{"$error":"#REF!"},{"$error":"#REF!"},{"$error":"#REF!"},{"$error":"#REF!"},{"$error":"#REF!"},null,null,null,null,null,null,null,null,null,null,null,null,45,"AS",null,null,null,null,null,"1999-09-01",5.0000000000000001E-3,null,"1999-09-01",1.49E-2,"1999-09-01","1999-09-01",1.49E-2,null,"1999-09-01","1999-09-01","","","",1.49E-2,1.49E-2,2.5325999999999995,null,null,null,null,null,null,null,null,null,null,null,"",null,"2004-09-01",4.8999999999999998E-3,null,"2004-09-01",6.7366399999997384E-3]
[null,"2003-10-01",240,"2003-10-01",240,null,"2004-10-01",3.2000000000000002E-3,"2004-10-01",3.2000000000000002E-3,null,"2004-10-01",4.4000000000000003E-3,"2004-10-01",4.4000000000000003E-3,null,"2004-10-01",1.108E-3,"2004-10-01",1.108E-3,null,"2010-06-01",-1.1000000000000001E-3,"2010-06-01",-1.1000000000000001E-3,null,null,null,null,null,null,"1999-10-01",4.7359999999999998E-3,5.5459999999999997E-3,6.3480000000000003E-3,7.143E-3,null,"2004-10-01",3.2000000000000002E-3,null,"2004-10-01",2.4659999999999999E-3,3.2729999999999999E-3,4.0740000000000004E-3,4.8669999999999998E-3,null,54,{"$error":"#REF!"},{"$error":"#REF!"},{"$error":"#REF!"},{"$error":"#REF!"},{"$error":"#REF!"},null,null,null,null,null,null,null,null,null,null,null,null,46,"AT",null,null,null,null,null,"1999-10-01",5.0000000000000001E-3,null,"1999-10-01",1.38E-2,"1999-10-01","1999-10-01",1.38E-2,null,"1999-10-01","1999-10-01","","","",1.38E-2,1.38E-2,2.5187999999999997,null,null,null,null,null,null,null,null,null,null,null,"",null,"2004-10-01",3.2000000000000002E-3,null,"2004-10-01",6.1135400000000839E-3]
[null,"2003-11-01",240,"2003-11-01",240,null,"2004-11-01",6.3E-3,"2004-11-01",6.3E-3,null,"2004-11-01",6.8999999999999999E-3,"2004-11-01",6.8999999999999999E-3,null,"2004-11-01",1.1460000000000001E-3,"2004-11-01",1.1460000000000001E-3,null,"2010-07-01",-6.9999999999999999E-4,"2010-07-01",-6.9999999999999999E-4,null,null,null,null,null,null,"1999-11-01",4.4689999999999999E-3,5.2779999999999997E-3,6.0800000000000003E-3,6.875E-3,null,"2004-11-01",6.3E-3,null,"2004-11-01",2.4659999999999999E-3,3.2729999999999999E-3,4.0740000000000004E-3,4.8669999999999998E-3,null,55,{"$error":"#REF!"},{"$error":"#REF!"},{"$error":"#REF!"},{"$error":"#REF!"},{"$error":"#REF!"},null,null,null,null,null,null,null,null,null,null,null,null,47,"AU",null,null,null,null,null,"1999-11-01",5.0000000000000001E-3,null,"1999-11-01",1.3899999999999999E-2,"1999-11-01","1999-11-01",1.3899999999999999E-2,null,"1999-11-01","1999-11-01","","","",1.3899999999999999E-2,1.3899999999999999E-2,2.5048999999999997,null,null,null,null,null,null,null,null,null,null,null,"",null,"2004-11-01",6.3E-3,null,"2004-11-01",6.1517300000000219E-3]
[null,"2003-12-01",240,"2003-12-01",240,null,"2004-12-01",8.3999999999999995E-3,"2004-12-01",8.3999999999999995E-3,null,"2004-12-01",8.6E-3,"2004-12-01",8.6E-3,null,"2004-12-01",2.3999999999999998E-3,"2004-12-01",2.3999999999999998E-3,null,"2010-08-01",-6.9999999999999999E-4,"2010-08-01",-6.9999999999999999E-4,null,null,null,null,null,null,"1999-12-01",5.4710000000000002E-3,6.2810000000000001E-3,7.084E-3,7.8799999999999999E-3,null,"2004-12-01",8.3999999999999995E-3,null,"2004-12-01",2.4659999999999999E-3,3.2729999999999999E-3,4.0740000000000004E-3,4.8669999999999998E-3,null,56,{"$error":"#REF!"},{"$error":"#REF!"},{"$error":"#REF!"},{"$error":"#REF!"},{"$error":"#REF!"},null,null,null,null,null,null,null,null,null,null,null,null,48,"AV",null,null,null,null,null,"1999-12-01",5.0000000000000001E-3,null,"1999-12-01",1.6E-2,"1999-12-01","1999-12-01",1.6E-2,null,"1999-12-01","1999-12-01","","","",1.6E-2,1.6E-2,2.4888999999999997,null,null,null,null,null,null,null,null,null,null,null,"",null,"2004-12-01",8.3999999999999995E-3,null,"2004-12-01",7.4119999999997521E-3]
[null,"2004-01-01",240,"2004-01-01",240,null,"2005-01-01",6.7999999999999996E-3,"2005-01-01",6.7999999999999996E-3,null,"2005-01-01",5.7999999999999996E-3,"2005-01-01",5.7999999999999996E-3,null,"2005-01-01",1.8799999999999999E-3,"2005-01-01",1.8799999999999999E-3,null,"2010-09-01",5.4000000000000003E-3,"2010-09-01",5.4000000000000003E-3,null,null,null,null,null,null,"2000-01-01",4.62E-3,5.4289999999999998E-3,6.2310000000000004E-3,7.0270000000000003E-3,null,"2005-01-01",6.7999999999999996E-3,null,"2005-01-01",2.4659999999999999E-3,3.2729999999999999E-3,4.0740000000000004E-3,4.8669999999999998E-3,null,57,{"$error":"#REF!"},{"$error":"#REF!"},{"$error":"#REF!"},{"$error":"#REF!"},{"$error":"#REF!"},null,null,null,null,null,null,null,null,null,null,null,null,49,"AW",null,null,null,null,null,"2000-01-01",5.0000000000000001E-3,null,"2000-01-01",1.46E-2,"2000-01-01","2000-01-01",1.46E-2,null,"2000-01-01","2000-01-01","","","",1.46E-2,1.46E-2,2.4742999999999995,null,null,null,null,null,null,null,null,null,null,null,"",null,"2005-01-01",6.7999999999999996E-3,null,"2005-01-01",6.8893999999999345E-3]
[null,"2004-02-01",240,"2004-02-01",240,null,"2005-02-01",7.4000000000000003E-3,"2005-02-01",7.4000000000000003E-3,null,"2005-02-01",5.8999999999999999E-3,"2005-02-01",5.8999999999999999E-3,null,"2005-02-01",9.6199999999999996E-4,"2005-02-01",9.6199999999999996E-4,null,"2010-10-01",9.1999999999999998E-3,"2010-10-01",9.1999999999999998E-3,null,null,null,null,null,null,"2000-02-01",4.7999999999999996E-3,5.6090000000000003E-3,6.411E-3,7.2059999999999997E-3,null,"2005-02-01",7.4000000000000003E-3,null,"2005-02-01",2.4659999999999999E-3,3.2729999999999999E-3,4.0740000000000004E-3,4.8669999999999998E-3,null,58,{"$error":"#REF!"},{"$error":"#REF!"},{"$error":"#REF!"},{"$error":"#REF!"},{"$error":"#REF!"},null,null,null,null,null,null,null,null,null,null,null,null,50,"AX",null,null,null,null,null,"2000-02-01",5.0000000000000001E-3,null,"2000-02-01",1.4500000000000001E-2,"2000-02-01","2000-02-01",1.4500000000000001E-2,null,"2000-02-01","2000-02-01","","","",1.4500000000000001E-2,1.4500000000000001E-2,2.4597999999999995,null,null,null,null,null,null,null,null,null,null,null,"",null,"2005-02-01",7.4000000000000003E-3,null,"2005-02-01",5.966809999999878E-3]
[null,"2004-03-01",240,"2004-03-01",240,null,"2005-03-01",3.5000000000000001E-3,"2005-03-01",3.5000000000000001E-3,null,"2005-03-01",6.1000000000000004E-3,"2005-03-01",6.1000000000000004E-3,null,"2005-03-01",2.6350000000000002E-3,"2005-03-01",2.6350000000000002E-3,null,"2010-11-01",1.03E-2,"2010-11-01",1.03E-2,null,null,null,null,null,null,"2000-03-01",4.7130000000000002E-3,5.5230000000000001E-3,6.3249999999999999E-3,7.1199999999999996E-3,null,"2005-03-01",3.5000000000000001E-3,null,"2005-03-01",2.4659999999999999E-3,3.2729999999999999E-3,4.0740000000000004E-3,4.8669999999999998E-3,null,59,{"$error":"#REF!"},{"$error":"#REF!"},{"$error":"#REF!"},{"$error":"#REF!"},{"$error":"#REF!"},null,null,null,null,null,null,null,null,null,null,null,null,51,"AY",null,null,null,null,null,"2000-03-01",5.0000000000000001E-3,null,"2000-03-01",1.4500000000000001E-2,"2000-03-01","2000-03-01",1.4500000000000001E-2,null,"2000-03-01","2000-03-01","","","",1.4500000000000001E-2,1.4500000000000001E-2,2.4452999999999996,null,null,null,null,null,null,null,null,null,null,null,"",null,"2005-03-01",3.5000000000000001E-3,null,"2005-03-01",7.6481749999999238E-3]
[null,"2004-04-01",240,"2004-04-01",240,null,"2005-04-01",7.4000000000000003E-3,"2005-04-01",7.4000000000000003E-3,null,"2005-04-01",8.6999999999999994E-3,"2005-04-01",8.6999999999999994E-3,null,"2005-04-01",2.003E-3,"2005-04-01",2.003E-3,null,"2010-12-01",6.0000000000000001E-3,"2010-12-01",6.0000000000000001E-3,null,null,null,null,null,null,"2000-04-01",3.7699999999999999E-3,4.5779999999999996E-3,5.3800000000000002E-3,6.1739999999999998E-3,null,"2005-04-01",7.4000000000000003E-3,null,"2005-04-01",2.4659999999999999E-3,3.2729999999999999E-3,4.0740000000000004E-3,4.8669999999999998E-3,null,60,{"$error":"#REF!"},{"$error":"#REF!"},{"$error":"#REF!"},{"$error":"#REF!"},{"$error":"#REF!"},null,null,null,null,null,null,null,null,null,null,null,null,52,"AZ",null,null,null,null,null,"2000-04-01",5.0000000000000001E-3,null,"2000-04-01",1.2999999999999999E-2,"2000-04-01","2000-04-01",1.2999999999999999E-2,null,"2000-04-01","2000-04-01","","","",1.2999999999999999E-2,1.2999999999999999E-2,2.4322999999999997,null,null,null,null,null,null,null,null,null,null,null,"",null,"2005-04-01",7.4000000000000003E-3,null,"2005-04-01",7.0130149999998448E-3]
[null,"2004-05-01",260,"2004-05-01",260,null,"2005-05-01",8.3000000000000001E-3,"2005-05-01",8.3000000000000001E-3,null,"2005-05-01",4.8999999999999998E-3,"2005-05-01",4.8999999999999998E-3,null,"2005-05-01",2.5270000000000002E-3,"2005-05-01",2.5270000000000002E-3,null,"2011-01-01",9.4000000000000004E-3,"2011-01-01",9.4000000000000004E-3,null,null,null,null,null,null,"2000-05-01",4.9639999999999997E-3,5.7730000000000004E-3,6.5760000000000002E-3,7.3709999999999999E-3,null,"2005-05-01",8.3000000000000001E-3,null,"2005-05-01",2.4659999999999999E-3,3.2729999999999999E-3,4.0740000000000004E-3,4.8669999999999998E-3,null,61,{"$error":"#REF!"},{"$error":"#REF!"},{"$error":"#REF!"},{"$error":"#REF!"},{"$error":"#REF!"},null,null,null,null,null,null,null,null,null,null,null,null,53,"BA",null,null,null,null,null,"2000-05-01",5.0000000000000001E-3,null,"2000-05-01",1.49E-2,"2000-05-01","2000-05-01",1.49E-2,null,"2000-05-01","2000-05-01","","","",1.49E-2,1.49E-2,2.4173999999999998,null,null,null,null,null,null,null,null,null,null,null,"",null,"2005-05-01",8.3000000000000001E-3,null,"2005-05-01",7.539634999999878E-3]
[null,"2004-06-01",260,"2004-06-01",260,null,"2005-06-01",1.1999999999999999E-3,"2005-06-01",1.1999999999999999E-3,null,"2005-06-01",-2.0000000000000001E-4,"2005-06-01",-2.0000000000000001E-4,null,"2005-06-01",2.993E-3,"2005-06-01",2.993E-3,null,"2011-02-01",5.4000000000000003E-3,"2011-02-01",5.4000000000000003E-3,null,null,null,null,null,null,"2000-06-01",4.6109999999999996E-3,5.4200000000000003E-3,6.2220000000000001E-3,7.0169999999999998E-3,null,"2005-06-01",1.1999999999999999E-3,null,"2005-06-01",2.4659999999999999E-3,3.2729999999999999E-3,4.0740000000000004E-3,4.8669999999999998E-3,null,62,{"$error":"#REF!"},{"$error":"#REF!"},{"$error":"#REF!"},{"$error":"#REF!"},{"$error":"#REF!"},null,null,null,null,null,null,null,null,null,null,null,null,54,"BB",null,null,null,null,null,"2000-06-01",5.0000000000000001E-3,null,"2000-06-01",1.3899999999999999E-2,"2000-06-01","2000-06-01",1.3899999999999999E-2,null,"2000-06-01","2000-06-01","","","",1.3899999999999999E-2,1.3899999999999999E-2,2.4034999999999997,null,null,null,null,null,null,null,null,null,null,null,"",null,"2005-06-01",1.1999999999999999E-3,null,"2005-06-01",8.0079650000000058E-3]
[null,"2004-07-01",260,"2004-07-01",260,null,"2005-07-01",1.1000000000000001E-3,"2005-07-01",1.1000000000000001E-3,null,"2005-07-01",2.5000000000000001E-3,"2005-07-01",2.5000000000000001E-3,null,"2005-07-01",2.575E-3,"2005-07-01",2.575E-3,null,"2011-03-01",6.6E-3,"2011-03-01",6.6E-3,null,null,null,null,null,null,"2000-07-01",4.0169999999999997E-3,4.8250000000000003E-3,5.6270000000000001E-3,6.4219999999999998E-3,null,"2005-07-01",1.1000000000000001E-3,null,"2005-07-01",2.4659999999999999E-3,3.2729999999999999E-3,4.0740000000000004E-3,4.8669999999999998E-3,null,63,{"$error":"#REF!"},{"$error":"#REF!"},{"$error":"#REF!"},{"$error":"#REF!"},{"$error":"#REF!"},null,null,null,null,null,null,null,null,null,null,null,null,55,"BC",null,null,null,null,null,"2000-07-01",5.0000000000000001E-3,null,"2000-07-01",1.3100000000000001E-2,"2000-07-01","2000-07-01",1.3100000000000001E-2,null,"2000-07-01","2000-07-01","","","",1.3100000000000001E-2,1.3100000000000001E-2,2.3903999999999996,null,null,null,null,null,null,null,null,null,null,null,"",null,"2005-07-01",1.1000000000000001E-3,null,"2005-07-01",7.5878749999997996E-3]
[null,"2004-08-01",260,"2004-08-01",260,null,"2005-08-01",2.8E-3,"2005-08-01",2.8E-3,null,"2005-08-01",1.6999999999999999E-3,"2005-08-01",1.6999999999999999E-3,null,"2005-08-01",3.4659999999999999E-3,"2005-08-01",3.4659999999999999E-3,null,"2011-04-01",7.1999999999999998E-3,"2011-04-01",7.1999999999999998E-3,null,null,null,null,null,null,"2000-08-01",4.496E-3,5.3049999999999998E-3,6.1069999999999996E-3,6.9020000000000001E-3,null,"2005-08-01",2.8E-3,null,"2005-08-01",2.4659999999999999E-3,3.2729999999999999E-3,4.0740000000000004E-3,4.8669999999999998E-3,null,64,{"$error":"#REF!"},{"$error":"#REF!"},{"$error":"#REF!"},{"$error":"#REF!"},{"$error":"#REF!"},null,null,null,null,null,null,null,null,null,null,null,null,56,"BD",null,null,null,null,null,"2000-08-01",5.0000000000000001E-3,null,"2000-08-01",1.41E-2,"2000-08-01","2000-08-01",1.41E-2,null,"2000-08-01","2000-08-01","","","",1.41E-2,1.41E-2,2.3762999999999996,null,null,null,null,null,null,null,null,null,null,null,"",null,"2005-08-01",2.8E-3,null,"2005-08-01",8.4833299999997891E-3]
[null,"2004-09-01",260,"2004-09-01",260,null,"2005-09-01",1.6000000000000001E-3,"2005-09-01",1.6000000000000001E-3,null,"2005-09-01",3.5000000000000001E-3,"2005-09-01",3.5000000000000001E-3,null,"2005-09-01",2.637E-3,"2005-09-01",2.637E-3,null,"2011-05-01",5.7000000000000002E-3,"2011-05-01",5.7000000000000002E-3,null,null,null,null,null,null,"2000-09-01",3.506E-3,4.3150000000000003E-3,5.1159999999999999E-3,5.9100000000000003E-3,null,"2005-09-01",1.6000000000000001E-3,null,"2005-09-01",2.4659999999999999E-3,3.2729999999999999E-3,4.0740000000000004E-3,4.8669999999999998E-3,null,65,{"$error":"#REF!"},{"$error":"#REF!"},{"$error":"#REF!"},{"$error":"#REF!"},{"$error":"#REF!"},null,null,null,null,null,null,null,null,null,null,null,null,57,"BE",null,null,null,null,null,"2000-09-01",5.0000000000000001E-3,null,"2000-09-01",1.2200000000000001E-2,"2000-09-01","2000-09-01",1.2200000000000001E-2,null,"2000-09-01","2000-09-01","","","",1.2200000000000001E-2,1.2200000000000001E-2,2.3640999999999996,null,null,null,null,null,null,null,null,null,null,null,"",null,"2005-09-01",1.6000000000000001E-3,null,"2005-09-01",7.6501849999999205E-3]
[null,"2004-10-01",260,"2004-10-01",260,null,"2005-10-01",5.5999999999999999E-3,"2005-10-01",5.5999999999999999E-3,null,"2005-10-01",7.4999999999999997E-3,"2005-10-01",7.4999999999999997E-3,null,"2005-10-01",2.0999999999999999E-3,"2005-10-01",2.0999999999999999E-3,null,"2011-06-01",2.2000000000000001E-3,"2011-06-01",2.2000000000000001E-3,null,null,null,null,null,null,"2000-10-01",3.7850000000000002E-3,4.594E-3,5.3949999999999996E-3,6.1890000000000001E-3,null,"2005-10-01",5.5999999999999999E-3,null,"2005-10-01",2.4659999999999999E-3,3.2729999999999999E-3,4.0740000000000004E-3,4.8669999999999998E-3,null,66,{"$error":"#REF!"},{"$error":"#REF!"},{"$error":"#REF!"},{"$error":"#REF!"},{"$error":"#REF!"},null,null,null,null,null,null,null,null,null,null,null,null,58,"BF",null,null,null,null,null,"2000-10-01",5.0000000000000001E-3,null,"2000-10-01",1.29E-2,"2000-10-01","2000-10-01",1.29E-2,null,"2000-10-01","2000-10-01","","","",1.29E-2,1.29E-2,2.3511999999999995,null,null,null,null,null,null,null,null,null,null,null,"",null,"2005-10-01",5.5999999999999999E-3,null,"2005-10-01",7.1104999999997975E-3]
[null,"2004-11-01",260,"2004-11-01",260,null,"2005-11-01",7.7999999999999996E-3,"2005-11-01",7.7999999999999996E-3,null,"2005-11-01",5.4999999999999997E-3,"2005-11-01",5.4999999999999997E-3,null,"2005-11-01",1.9289999999999999E-3,"2005-11-01",1.9289999999999999E-3,null,"2011-07-01",0,"2011-07-01",0,null,null,null,null,null,null,"2000-11-01",3.666E-3,4.4739999999999997E-3,5.2750000000000002E-3,6.0699999999999999E-3,null,"2005-11-01",7.7999999999999996E-3,null,"2005-11-01",2.4659999999999999E-3,3.2729999999999999E-3,4.0740000000000004E-3,4.8669999999999998E-3,null,67,{"$error":"#REF!"},{"$error":"#REF!"},{"$error":"#REF!"},{"$error":"#REF!"},{"$error":"#REF!"},null,null,null,null,null,null,null,null,null,null,null,null,59,"BG",null,null,null,null,null,"2000-11-01",5.0000000000000001E-3,null,"2000-11-01",1.2200000000000001E-2,"2000-11-01","2000-11-01",1.2200000000000001E-2,null,"2000-11-01","2000-11-01","","","",1.2200000000000001E-2,1.2200000000000001E-2,2.3389999999999995,null,null,null,null,null,null,null,null,null,null,null,"",null,"2005-11-01",7.7999999999999996E-3,null,"2005-11-01",6.9386449999999655E-3]
[null,"2004-12-01",260,"2004-12-01",260,null,"2005-12-01",3.8E-3,"2005-12-01",3.8E-3,null,"2005-12-01",3.5999999999999999E-3,"2005-12-01",3.5999999999999999E-3,null,"2005-12-01",2.2690000000000002E-3,"2005-12-01",2.2690000000000002E-3,null,"2011-08-01",4.1999999999999997E-3,"2011-08-01",4.1999999999999997E-3,null,null,null,null,null,null,"2000-12-01",3.4589999999999998E-3,4.267E-3,5.0689999999999997E-3,5.8630000000000002E-3,null,"2005-12-01",3.8E-3,null,"2005-12-01",2.4659999999999999E-3,3.2729999999999999E-3,4.0740000000000004E-3,4.8669999999999998E-3,null,68,{"$error":"#REF!"},{"$error":"#REF!"},{"$error":"#REF!"},{"$error":"#REF!"},{"$error":"#REF!"},null,null,null,null,null,null,null,null,null,null,null,null,60,"BH",null,null,null,null,null,"2000-12-01",5.0000000000000001E-3,null,"2000-12-01",1.2E-2,"2000-12-01","2000-12-01",1.2E-2,null,"2000-12-01","2000-12-01","","","",1.2E-2,1.2E-2,2.3269999999999995,null,null,null,null,null,null,null,null,null,null,null,"",null,"2005-12-01",3.8E-3,null,"2005-12-01",7.2803450000000769E-3]
[null,"2005-01-01",260,"2005-01-01",260,null,"2006-01-01",5.1000000000000004E-3,"2006-01-01",5.1000000000000004E-3,null,"2006-01-01",5.8999999999999999E-3,"2006-01-01",5.8999999999999999E-3,null,"2006-01-01",2.3259999999999999E-3,"2006-01-01",2.3259999999999999E-3,null,"2011-09-01",4.4999999999999997E-3,"2011-09-01",4.4999999999999997E-3,null,null,null,null,null,null,"2001-01-01",3.8379999999999998E-3,4.6470000000000001E-3,5.4479999999999997E-3,6.2430000000000003E-3,null,"2006-01-01",5.1000000000000004E-3,null,"2006-01-01",2.4659999999999999E-3,3.2729999999999999E-3,4.0740000000000004E-3,4.8669999999999998E-3,null,69,{"$error":"#REF!"},{"$error":"#REF!"},{"$error":"#REF!"},{"$error":"#REF!"},{"$error":"#REF!"},null,null,null,null,null,null,null,null,null,null,null,null,61,"BI",null,null,null,"2001-01-01",5.0000000000000001E-3,{"$f":"+IF(AND(TRIM(BR69)=\"\",TRIM(BR68)<>\"\"),\"\",IF(TRIM(BR69)=\"\",\"\",TRUNC(BR69,0)))","v":"2001-01-01"},{"$f":"IF(TRIM(BS69)=\"\",\"\",BS69)","v":5.0000000000000001E-3},null,"2001-01-01",1.2699999999999999E-2,"2001-01-01","2001-01-01",1.2699999999999999E-2,null,{"$f":"+IF(BT69=\"\",\"\",BT69)","v":"2001-01-01"},"2001-01-01","","","",1.2699999999999999E-2,1.2699999999999999E-2,2.3142999999999994,null,null,null,null,null,null,null,null,null,null,null,"",null,"2006-01-01",5.1000000000000004E-3,null,"2006-01-01",7.3376299999998729E-3]
[null,"2005-02-01",260,"2005-02-01",260,null,"2006-02-01",5.1999999999999998E-3,"2006-02-01",5.1999999999999998E-3,null,"2006-02-01",4.1000000000000003E-3,"2006-02-01",4.1000000000000003E-3,null,"2006-02-01",7.2499999999999995E-4,"2006-02-01",7.2499999999999995E-4,null,"2011-10-01",3.2000000000000002E-3,"2011-10-01",3.2000000000000002E-3,null,null,null,null,null,null,"2001-02-01",2.8349999999999998E-3,3.6419999999999998E-3,4.4429999999999999E-3,5.2370000000000003E-3,null,"2006-02-01",5.1999999999999998E-3,null,"2006-02-01",2.4659999999999999E-3,3.2729999999999999E-3,4.0740000000000004E-3,4.8669999999999998E-3,null,70,{"$error":"#REF!"},{"$error":"#REF!"},{"$error":"#REF!"},{"$error":"#REF!"},{"$error":"#REF!"},null,null,null,null,null,null,null,null,null,null,null,null,62,"BJ",null,null,null,"2001-02-01",5.0000000000000001E-3,"2001-02-01",{"$f":"IF(TRIM(BS70)=\"\",\"\",BS70)","v":5.0000000000000001E-3},null,"2001-02-01",1.0200000000000001E-2,"2001-02-01","2001-02-01",1.0200000000000001E-2,null,{"$f":"+IF(BT70=\"\",\"\",BT70)","v":"2001-02-01"},"2001-02-01","","","",1.0200000000000001E-2,1.0200000000000001E-2,2.3040999999999991,null,null,null,null,null,null,null,null,null,null,null,"",null,"2006-02-01",5.1999999999999998E-3,null,"2006-02-01",5.7286249999999317E-3]
[null,"2005-03-01",260,"2005-03-01",260,null,"2006-03-01",3.7000000000000002E-3,"2006-03-01",3.7000000000000002E-3,null,"2006-03-01",4.3E-3,"2006-03-01",4.3E-3,null,"2006-03-01",2.0730000000000002E-3,"2006-03-01",2.0730000000000002E-3,null,"2011-11-01",5.7000000000000002E-3,"2011-11-01",5.7000000000000002E-3,null,null,null,null,null,null,"2001-03-01",4.1939999999999998E-3,5.0029999999999996E-3,5.8050000000000003E-3,6.5989999999999998E-3,null,"2006-03-01",3.7000000000000002E-3,null,"2006-03-01",2.4659999999999999E-3,3.2729999999999999E-3,4.0740000000000004E-3,4.8669999999999998E-3,null,71,{"$error":"#REF!"},{"$error":"#REF!"},{"$error":"#REF!"},{"$error":"#REF!"},{"$error":"#REF!"},null,null,null,null,null,null,null,null,null,null,null,null,63,"BK",null,null,null,"2001-03-01",5.0000000000000001E-3,"2001-03-01",5.0000000000000001E-3,null,"2001-03-01",1.26E-2,"2001-03-01","2001-03-01",1.26E-2,null,"2001-03-01","2001-03-01","","","",1.26E-2,1.26E-2,2.2914999999999992,null,null,null,null,null,null,null,null,null,null,null,"",null,"2006-03-01",3.7000000000000002E-3,null,"2006-03-01",7.0833649999999526E-3]
[null,"2005-04-01",260,"2005-04-01",260,null,"2006-04-01",1.6999999999999999E-3,"2006-04-01",1.6999999999999999E-3,null,"2006-04-01",2.0999999999999999E-3,"2006-04-01",2.0999999999999999E-3,null,"2006-04-01",8.5499999999999997E-4,"2006-04-01",8.5499999999999997E-4,null,"2011-12-01",5.1000000000000004E-3,"2011-12-01",5.1000000000000004E-3,null,null,null,null,null,null,"2001-04-01",4.0159999999999996E-3,4.8240000000000002E-3,5.6259999999999999E-3,6.4209999999999996E-3,null,"2006-04-01",1.6999999999999999E-3,null,"2006-04-01",2.4659999999999999E-3,3.2729999999999999E-3,4.0740000000000004E-3,4.8669999999999998E-3,null,72,{"$error":"#REF!"},{"$error":"#REF!"},{"$error":"#REF!"},{"$error":"#REF!"},{"$error":"#REF!"},null,null,null,null,null,null,null,null,null,null,null,null,64,"BL",null,null,null,"2001-04-01",5.0000000000000001E-3,"2001-04-01",5.0000000000000001E-3,null,"2001-04-01",1.1900000000000001E-2,"2001-04-01","2001-04-01",1.1900000000000001E-2,null,"2001-04-01","2001-04-01","","","",1.1900000000000001E-2,1.1900000000000001E-2,2.2795999999999994,null,null,null,null,null,null,null,null,null,null,null,"",null,"2006-04-01",1.6999999999999999E-3,null,"2006-04-01",5.8592749999999416E-3]
[null,"2005-05-01",300,"2005-05-01",300,null,"2006-05-01",2.7000000000000001E-3,{"$f":"+IF(AND(TRIM(G73)=\"\",TRIM(G72)<>\"\"),EDATE(I72,1),IF(TRIM(G73)=\"\",\"\",TRUNC(G73,0)))","v":"2006-05-01"},{"$f":"+IF(AND(H73=\"\",H72<>\"\"),0,IF(TRIM(H73)=\"\",\"\",H73))","v":2.7000000000000001E-3},null,"2006-05-01",1E-3,{"$f":"+IF(TRIM(L73)=\"\",\"\",TRUNC(L73,0))","v":"2006-05-01"},1E-3,null,"2006-05-01",1.8879999999999999E-3,{"$f":"+IF(AND(TRIM(Q73)=\"\",TRIM(Q72)<>\"\"),EDATE(S72,1),IF(TRIM(Q73)=\"\",\"\",TRUNC(Q73,0)))","v":"2006-05-01"},{"$f":"+IF(AND(R73=\"\",R72<>\"\"),0,IF(TRIM(R73)=\"\",\"\",R73))","v":1.8879999999999999E-3},null,"2012-01-01",5.1000000000000004E-3,{"$f":"+IF(AND(TRIM(V73)=\"\",TRIM(V72)<>\"\"),EDATE(X72,1),IF(TRIM(V73)=\"\",\"\",TRUNC(V73,0)))","v":"2012-01-01"},{"$f":"+IF(AND(W73=\"\",W72<>\"\"),0,IF(TRIM(W73)=\"\",\"\",W73))","v":5.1000000000000004E-3},null,null,null,null,null,null,"2001-05-01",4.2969999999999996E-3,5.1060000000000003E-3,5.9080000000000001E-3,6.7029999999999998E-3,null,{"$f":"+I73","v":"2006-05-01"},{"$f":"+J73","v":2.7000000000000001E-3},null,"2006-05-01",2.4659999999999999E-3,3.2729999999999999E-3,4.0740000000000004E-3,4.8669999999999998E-3,null,73,{"$f":"IF(INDIRECT(CONCATENATE(VLET_DT,TEXT(AU73,\"#0\")))=\"\",\"\",INDIRECT(CONCATENATE(VLET_DT,TEXT(AU73,\"#0\"))))","v":{"$error":"#REF!"}},{"$f":"+IF(AV73=\"\",\"\",IF(AV73<=VDAT_AT,AV73,\"\"))","v":{"$error":"#REF!"}},{"$f":"IF(OR(AW73=\"\",INDIRECT(CONCATENATE(VLET_COT,TEXT(AU73,\"#0\")))=\"\"),\"\",IF(AW73=VDAT_AT,1+IF(COD_CM=4,0.01,0),INDIRECT(CONCATENATE(VLET_COT,TEXT(AU73,\"#0\")))))","v":{"$error":"#REF!"}},{"$f":"+IF(COD_CM=4,IF(AX73=\"\",\"\",AX73+IF(AY74=\"\",0,AY74)),IF(OR(AV73>VDAT_AT,AV73=\"\"),\"\",IF(AV73=VDAT_AT,1,IF(AY74=\"\",1,AY74)*(1+AX73)/AZ73)))","v":{"$error":"#REF!"}},{"$f":"+IF(AW73=\"\",\"\",LOOKUP(AW73,COL_DAT_CORTE,COL_VAL_CORTE))","v":{"$error":"#REF!"}},null,null,null,null,null,null,null,null,null,null,null,null,65,"BM",null,null,null,"2001-05-01",5.0000000000000001E-3,"2001-05-01",5.0000000000000001E-3,null,"2001-05-01",1.34E-2,{"$f":"+IF(AND(TRIM(BW73)=\"\",TRIM(BW72)<>\"\"),EDATE(BY72,1),IF(TRIM(BW73)=\"\",\"\",TRUNC(BW73,0)))","v":"2001-05-01"},{"$f":"+IF(BY73=\"\",\"\",IF(BY73<=VDAT_AT,BY73,\"\"))","v":"2001-05-01"},{"$f":"+IF(BY73>VDAT_AT,\"\",IF(AND(BZ73<>\"\",BZ74=\"\"),0.01,IF(TRIM(BX73)=\"\",\"\",BX73)))","v":1.34E-2},null,"2001-05-01","2001-05-01",{"$f":"+IF(CC73=\"\",\"\",IF(COD_JUROS=1,0.5%,IF(COD_JUROS=4,1%,IF(COD_JUROS=11,0%,\"\"))))","v":""},{"$f":"+IF(OR(COD_JUROS<>2,CD73=\"\"),\"\",BU73)","v":""},{"$f":"+IF(OR(COD_JUROS<>3,CD73=\"\"),\"\",0.5%)","v":""},{"$f":"+IF(OR(COD_JUROS<>10,CD73=\"\"),\"\",CA73)","v":1.34E-2},1.34E-2,{"$f":"+IF(CI73=\"\",\"\",IF(CD73=VDAT_AT1,0,CI74+IF(CJ74=\"\",0,CJ74)))","v":2.2661999999999995},null,null,null,null,null,null,null,null,null,null,null,"",null,{"$f":"+I73","v":"2006-05-01"},{"$f":"+J73","v":2.7000000000000001E-3},null,{"$f":"+S73","v":"2006-05-01"},{"$f":"+IF(OR(T73=\"\",BU133=\"\"),\"\",((1+T73)*(1+BU133)-1))","v":6.8974399999996994E-3}]
[null,"2005-06-01",300,{"$f":"+IF(TRIM(B74)=\"\",\"\",B74)","v":"2005-06-01"},300,null,"2006-06-01",-1.5E-3,"2006-06-01",-1.5E-3,null,"2006-06-01",-2.0999999999999999E-3,"2006-06-01",{"$f":"+IF(TRIM(M74)=\"\",\"\",M74)","v":-2.0999999999999999E-3},null,"2006-06-01",1.9369999999999999E-3,"2006-06-01",1.9369999999999999E-3,null,"2012-02-01",3.8999999999999998E-3,"2012-02-01",3.8999999999999998E-3,null,null,null,null,null,null,"2001-06-01",3.9269999999999999E-3,4.7359999999999998E-3,5.5380000000000004E-3,6.332E-3,null,"2006-06-01",-1.5E-3,null,"2006-06-01",2.4659999999999999E-3,3.2729999999999999E-3,4.0740000000000004E-3,4.8669999999999998E-3,null,74,{"$error":"#REF!"},{"$error":"#REF!"},{"$error":"#REF!"},{"$error":"#REF!"},{"$error":"#REF!"},null,null,null,null,null,null,null,null,null,null,null,null,66,"BN",null,null,null,"2001-06-01",5.0000000000000001E-3,"2001-06-01",5.0000000000000001E-3,null,"2001-06-01",1.2699999999999999E-2,"2001-06-01","2001-06-01",1.2699999999999999E-2,null,"2001-06-01",{"$f":"+IF(CD73=\"\",\"\",IF(EDATE(CD73,1)<=VDAT_AT1,EDATE(CD73,1),\"\"))","v":"2001-06-01"},"","","",1.2699999999999999E-2,{"$f":"+IF(CD74=\"\",\"\",SUM(CE74:CH74))","v":1.2699999999999999E-2},2.2534999999999994,null,null,null,null,null,null,null,null,null,null,null,{"$f":"+IF(CU74=\"\",\"\",TRIM(CU74))","v":""},null,"2006-06-01",-1.5E-3,null,"2006-06-01",6.9466849999999525E-3]
[null,"2005-07-01",300,"2005-07-01",300,null,"2006-07-01",-2.0000000000000001E-4,"2006-07-01",-2.0000000000000001E-4,null,"2006-07-01",1.9E-3,"2006-07-01",1.9E-3,null,"2006-07-01",1.751E-3,"2006-07-01",1.751E-3,null,"2012-03-01",1.8E-3,"2012-03-01",1.8E-3,null,null,null,null,null,null,"2001-07-01",4.9129999999999998E-3,5.7219999999999997E-3,6.5250000000000004E-3,7.3200000000000001E-3,null,"2006-07-01",-2.0000000000000001E-4,null,"2006-07-01",2.4659999999999999E-3,3.2729999999999999E-3,4.0740000000000004E-3,4.8669999999999998E-3,null,75,{"$error":"#REF!"},{"$error":"#REF!"},{"$error":"#REF!"},{"$error":"#REF!"},{"$error":"#REF!"},null,null,null,null,null,null,null,null,null,null,null,null,67,"BO",null,null,null,"2001-07-01",5.0000000000000001E-3,"2001-07-01",5.0000000000000001E-3,null,"2001-07-01",1.4999999999999999E-2,"2001-07-01","2001-07-01",1.4999999999999999E-2,null,"2001-07-01","2001-07-01","","","",1.4999999999999999E-2,1.4999999999999999E-2,2.2384999999999993,null,null,null,null,null,null,null,null,null,null,null,"",null,"2006-07-01",-2.0000000000000001E-4,null,"2006-07-01",6.7597550000000339E-3]
[null,"2005-08-01",300,"2005-08-01",300,null,"2006-08-01",1.9E-3,"2006-08-01",1.9E-3,null,"2006-08-01",5.0000000000000001E-4,"2006-08-01",5.0000000000000001E-4,null,"2006-08-01",2.4359999999999998E-3,"2006-08-01",2.4359999999999998E-3,null,"2012-04-01",6.4000000000000003E-3,"2012-04-01",6.4000000000000003E-3,null,null,null,null,null,null,"2001-08-01",5.9100000000000003E-3,6.7200000000000003E-3,7.5240000000000003E-3,8.3199999999999993E-3,null,"2006-08-01",1.9E-3,null,"2006-08-01",2.4659999999999999E-3,3.2729999999999999E-3,4.0740000000000004E-3,4.8669999999999998E-3,null,76,{"$error":"#REF!"},{"$error":"#REF!"},{"$error":"#REF!"},{"$error":"#REF!"},{"$error":"#REF!"},null,null,null,null,null,null,null,null,null,null,null,null,68,"BP",null,null,null,"2001-08-01",5.0000000000000001E-3,"2001-08-01",5.0000000000000001E-3,null,"2001-08-01",1.6E-2,"2001-08-01","2001-08-01",1.6E-2,null,"2001-08-01","2001-08-01","","","",1.6E-2,1.6E-2,2.2224999999999993,null,null,null,null,null,null,null,null,null,null,null,"",null,"2006-08-01",1.9E-3,null,"2006-08-01",7.4481799999999154E-3]
[null,"2005-09-01",300,"2005-09-01",300,null,"2006-09-01",5.0000000000000001E-4,"2006-09-01",5.0000000000000001E-4,null,"2006-09-01",2.0999999999999999E-3,"2006-09-01",2.0999999999999999E-3,null,"2006-09-01",1.521E-3,"2006-09-01",1.521E-3,null,"2012-05-01",5.4999999999999997E-3,"2012-05-01",5.4999999999999997E-3,null,null,null,null,null,null,"2001-09-01",4.0969999999999999E-3,4.9059999999999998E-3,5.7070000000000003E-3,6.502E-3,null,"2006-09-01",5.0000000000000001E-4,null,"2006-09-01",2.4659999999999999E-3,3.2729999999999999E-3,4.0740000000000004E-3,4.8669999999999998E-3,null,77,{"$error":"#REF!"},{"$error":"#REF!"},{"$error":"#REF!"},{"$error":"#REF!"},{"$error":"#REF!"},null,null,null,null,null,null,null,null,null,null,null,null,69,"BQ",null,null,null,"2001-09-01",5.0000000000000001E-3,"2001-09-01",5.0000000000000001E-3,null,"2001-09-01",1.32E-2,"2001-09-01","2001-09-01",1.32E-2,null,"2001-09-01","2001-09-01","","","",1.32E-2,1.32E-2,2.2092999999999994,null,null,null,null,null,null,null,null,null,null,null,"",null,"2006-09-01",5.0000000000000001E-4,null,"2006-09-01",6.5286049999999651E-3]
[null,"2005-10-01",300,"2005-10-01",300,null,"2006-10-01",2.8999999999999998E-3,"2006-10-01",2.8999999999999998E-3,null,"2006-10-01",3.3E-3,"2006-10-01",3.3E-3,null,"2006-10-01",1.8749999999999999E-3,"2006-10-01",1.8749999999999999E-3,null,"2012-06-01",2.5999999999999999E-3,"2012-06-01",2.5999999999999999E-3,null,null,null,null,null,null,"2001-10-01",5.3860000000000002E-3,6.1960000000000001E-3,6.9979999999999999E-3,7.7939999999999997E-3,null,"2006-10-01",2.8999999999999998E-3,null,"2006-10-01",2.4659999999999999E-3,3.2729999999999999E-3,4.0740000000000004E-3,4.8669999999999998E-3,null,78,{"$error":"#REF!"},{"$error":"#REF!"},{"$error":"#REF!"},{"$error":"#REF!"},{"$error":"#REF!"},null,null,null,null,null,null,null,null,null,null,null,null,70,"BR",null,null,null,"2001-10-01",5.0000000000000001E-3,"2001-10-01",5.0000000000000001E-3,null,"2001-10-01",1.5299999999999999E-2,"2001-10-01","2001-10-01",1.5299999999999999E-2,null,"2001-10-01","2001-10-01","","","",1.5299999999999999E-2,1.5299999999999999E-2,2.1939999999999995,null,null,null,null,null,null,null,null,null,null,null,"",null,"2006-10-01",2.8999999999999998E-3,null,"2006-10-01",6.8843750000000536E-3]
[null,"2005-11-01",300,"2005-11-01",300,null,"2006-11-01",3.7000000000000002E-3,"2006-11-01",3.7000000000000002E-3,null,"2006-11-01",3.0999999999999999E-3,"2006-11-01",3.0999999999999999E-3,null,"2006-11-01",1.2819999999999999E-3,"2006-11-01",1.2819999999999999E-3,null,"2012-07-01",4.3E-3,"2012-07-01",4.3E-3,null,null,null,null,null,null,"2001-11-01",4.3990000000000001E-3,5.208E-3,6.0089999999999996E-3,6.8040000000000002E-3,null,"2006-11-01",3.7000000000000002E-3,null,"2006-11-01",2.4659999999999999E-3,3.2729999999999999E-3,4.0740000000000004E-3,4.8669999999999998E-3,null,79,{"$error":"#REF!"},{"$error":"#REF!"},{"$error":"#REF!"},{"$error":"#REF!"},{"$error":"#REF!"},null,null,null,null,null,null,null,null,null,null,null,null,71,"BS",null,null,null,"2001-11-01",5.0000000000000001E-3,"2001-11-01",5.0000000000000001E-3,null,"2001-11-01",1.3899999999999999E-2,"2001-11-01","2001-11-01",1.3899999999999999E-2,null,"2001-11-01","2001-11-01","","","",1.3899999999999999E-2,1.3899999999999999E-2,2.1800999999999995,null,null,null,null,null,null,null,null,null,null,null,"",null,"2006-11-01",3.7000000000000002E-3,null,"2006-11-01",6.2884099999998E-3]
[null,"2005-12-01",300,"2005-12-01",300,null,"2006-12-01",3.5000000000000001E-3,"2006-12-01",3.5000000000000001E-3,null,"2006-12-01",4.7999999999999996E-3,"2006-12-01",4.7999999999999996E-3,null,"2006-12-01",1.5219999999999999E-3,"2006-12-01",1.5219999999999999E-3,null,"2012-08-01",4.4999999999999997E-3,"2012-08-01",4.4999999999999997E-3,null,null,null,null,null,null,"2001-12-01",4.4539999999999996E-3,5.2630000000000003E-3,6.0650000000000001E-3,6.8599999999999998E-3,null,"2006-12-01",3.5000000000000001E-3,null,"2006-12-01",2.4659999999999999E-3,3.2729999999999999E-3,4.0740000000000004E-3,4.8669999999999998E-3,null,80,{"$error":"#REF!"},{"$error":"#REF!"},{"$error":"#REF!"},{"$error":"#REF!"},{"$error":"#REF!"},null,null,null,null,null,null,null,null,null,null,null,null,72,"BT",null,null,null,"2001-12-01",5.0000000000000001E-3,"2001-12-01",5.0000000000000001E-3,null,"2001-12-01",1.3899999999999999E-2,"2001-12-01","2001-12-01",1.3899999999999999E-2,null,"2001-12-01","2001-12-01","","","",1.3899999999999999E-2,1.3899999999999999E-2,2.1661999999999995,null,null,null,null,null,null,null,null,null,null,null,"",null,"2006-12-01",3.5000000000000001E-3,null,"2006-12-01",6.5296099999998525E-3]
[null,"2006-01-01",300,"2006-01-01",300,null,"2007-01-01",5.1999999999999998E-3,"2007-01-01",5.1999999999999998E-3,null,"2007-01-01",4.4000000000000003E-3,"2007-01-01",4.4000000000000003E-3,null,"2007-01-01",2.189E-3,"2007-01-01",2.189E-3,null,"2012-09-01",6.3E-3,"2012-09-01",6.3E-3,null,null,null,null,null,null,"2002-01-01",5.0629999999999998E-3,5.8729999999999997E-3,6.6750000000000004E-3,7.4710000000000002E-3,null,"2007-01-01",5.1999999999999998E-3,null,"2007-01-01",2.4659999999999999E-3,3.2729999999999999E-3,4.0740000000000004E-3,4.8669999999999998E-3,null,81,{"$error":"#REF!"},{"$error":"#REF!"},{"$error":"#REF!"},{"$error":"#REF!"},{"$error":"#REF!"},null,null,null,null,null,null,null,null,null,null,null,null,73,"BU",null,null,null,"2002-01-01",5.0000000000000001E-3,"2002-01-01",5.0000000000000001E-3,null,"2002-01-01",1.5299999999999999E-2,"2002-01-01","2002-01-01",1.5299999999999999E-2,null,"2002-01-01","2002-01-01","","","",1.5299999999999999E-2,1.5299999999999999E-2,2.1508999999999996,null,null,null,null,null,null,null,null,null,null,null,"",null,"2007-01-01",5.1999999999999998E-3,null,"2007-01-01",7.1999449999999854E-3]
[null,"2006-02-01",300,"2006-02-01",300,null,"2007-02-01",4.5999999999999999E-3,"2007-02-01",4.5999999999999999E-3,null,"2007-02-01",4.4000000000000003E-3,"2007-02-01",4.4000000000000003E-3,null,"2007-02-01",7.2099999999999996E-4,"2007-02-01",7.2099999999999996E-4,null,"2012-10-01",7.1000000000000004E-3,"2012-10-01",7.1000000000000004E-3,null,null,null,null,null,null,"2002-02-01",3.64E-3,4.4479999999999997E-3,5.2490000000000002E-3,6.0439999999999999E-3,null,"2007-02-01",4.5999999999999999E-3,null,"2007-02-01",2.4659999999999999E-3,3.2729999999999999E-3,4.0740000000000004E-3,4.8669999999999998E-3,null,82,{"$error":"#REF!"},{"$error":"#REF!"},{"$error":"#REF!"},{"$error":"#REF!"},{"$error":"#REF!"},null,null,null,null,null,null,null,null,null,null,null,null,74,"BV",null,null,null,"2002-02-01",5.0000000000000001E-3,"2002-02-01",5.0000000000000001E-3,null,"2002-02-01",1.2500000000000001E-2,"2002-02-01","2002-02-01",1.2500000000000001E-2,null,"2002-02-01","2002-02-01","","","",1.2500000000000001E-2,1.2500000000000001E-2,2.1383999999999994,null,null,null,null,null,null,null,null,null,null,null,"",null,"2007-02-01",4.5999999999999999E-3,null,"2007-02-01",5.7246049999999382E-3]
[null,"2006-03-01",300,"2006-03-01",300,null,"2007-03-01",4.1000000000000003E-3,"2007-03-01",4.1000000000000003E-3,null,"2007-03-01",3.7000000000000002E-3,"2007-03-01",3.7000000000000002E-3,null,"2007-03-01",1.8760000000000001E-3,"2007-03-01",1.8760000000000001E-3,null,"2012-11-01",5.4000000000000003E-3,"2012-11-01",5.4000000000000003E-3,null,null,null,null,null,null,"2002-03-01",4.228E-3,5.0369999999999998E-3,5.8389999999999996E-3,6.6340000000000001E-3,null,"2007-03-01",4.1000000000000003E-3,null,"2007-03-01",2.4659999999999999E-3,3.2729999999999999E-3,4.0740000000000004E-3,4.8669999999999998E-3,null,83,{"$error":"#REF!"},{"$error":"#REF!"},{"$error":"#REF!"},{"$error":"#REF!"},{"$error":"#REF!"},null,null,null,null,null,null,null,null,null,null,null,null,75,"BW",null,null,null,"2002-03-01",5.0000000000000001E-3,"2002-03-01",5.0000000000000001E-3,null,"2002-03-01",1.37E-2,"2002-03-01","2002-03-01",1.37E-2,null,"2002-03-01","2002-03-01","","","",1.37E-2,1.37E-2,2.1246999999999994,null,null,null,null,null,null,null,null,null,null,null,"",null,"2007-03-01",4.1000000000000003E-3,null,"2007-03-01",6.885379999999941E-3]
[null,"2006-04-01",350,"2006-04-01",350,null,"2007-04-01",2.2000000000000001E-3,"2007-04-01",2.2000000000000001E-3,null,"2007-04-01",2.5000000000000001E-3,"2007-04-01",2.5000000000000001E-3,null,"2007-04-01",1.2719999999999999E-3,"2007-04-01",1.2719999999999999E-3,null,"2012-12-01",7.4000000000000003E-3,"2012-12-01",7.4000000000000003E-3,null,null,null,null,null,null,"2002-04-01",4.829E-3,5.6379999999999998E-3,6.4400000000000004E-3,7.2360000000000002E-3,null,"2007-04-01",2.2000000000000001E-3,null,"2007-04-01",2.4659999999999999E-3,3.2729999999999999E-3,4.0740000000000004E-3,4.8669999999999998E-3,null,84,{"$error":"#REF!"},{"$error":"#REF!"},{"$error":"#REF!"},{"$error":"#REF!"},{"$error":"#REF!"},null,null,null,null,null,null,null,null,null,null,null,null,76,"BX",null,null,null,"2002-04-01",5.0000000000000001E-3,"2002-04-01",5.0000000000000001E-3,null,"2002-04-01",1.4800000000000001E-2,"2002-04-01","2002-04-01",1.4800000000000001E-2,null,"2002-04-01","2002-04-01","","","",1.4800000000000001E-2,1.4800000000000001E-2,2.1098999999999992,null,null,null,null,null,null,null,null,null,null,null,"",null,"2007-04-01",2.2000000000000001E-3,null,"2007-04-01",6.2783599999998163E-3]
[null,"2006-05-01",350,"2006-05-01",350,null,"2007-05-01",2.5999999999999999E-3,"2007-05-01",2.5999999999999999E-3,null,"2007-05-01",2.8E-3,"2007-05-01",2.8E-3,null,"2007-05-01",1.689E-3,"2007-05-01",1.689E-3,null,"2013-01-01",9.1999999999999998E-3,"2013-01-01",9.1999999999999998E-3,null,null,null,null,null,null,"2002-05-01",4.5729999999999998E-3,5.3819999999999996E-3,6.1840000000000003E-3,6.979E-3,null,"2007-05-01",2.5999999999999999E-3,null,"2007-05-01",2.4659999999999999E-3,3.2729999999999999E-3,4.0740000000000004E-3,4.8669999999999998E-3,null,85,{"$error":"#REF!"},{"$error":"#REF!"},{"$error":"#REF!"},{"$error":"#REF!"},{"$error":"#REF!"},null,null,null,null,null,null,null,null,null,null,null,null,77,"BY",null,null,null,"2002-05-01",5.0000000000000001E-3,"2002-05-01",5.0000000000000001E-3,null,"2002-05-01",1.41E-2,"2002-05-01","2002-05-01",1.41E-2,null,"2002-05-01","2002-05-01","","","",1.41E-2,1.41E-2,2.0957999999999992,null,null,null,null,null,null,null,null,null,null,null,"",null,"2007-05-01",2.5999999999999999E-3,null,"2007-05-01",6.6974449999999131E-3]
[null,"2006-06-01",350,"2006-06-01",350,null,"2007-06-01",2.8999999999999998E-3,"2007-06-01",2.8999999999999998E-3,null,"2007-06-01",2.8E-3,"2007-06-01",2.8E-3,null,"2007-06-01",9.5399999999999999E-4,"2007-06-01",9.5399999999999999E-4,null,"2013-02-01",5.1999999999999998E-3,"2013-02-01",5.1999999999999998E-3,null,null,null,null,null,null,"2002-06-01",4.052E-3,4.8599999999999997E-3,5.6620000000000004E-3,6.4570000000000001E-3,null,"2007-06-01",2.8999999999999998E-3,null,"2007-06-01",2.4659999999999999E-3,3.2729999999999999E-3,4.0740000000000004E-3,4.8669999999999998E-3,null,86,{"$error":"#REF!"},{"$error":"#REF!"},{"$error":"#REF!"},{"$error":"#REF!"},{"$error":"#REF!"},null,null,null,null,null,null,null,null,null,null,null,null,78,"BZ",null,null,null,"2002-06-01",5.0000000000000001E-3,"2002-06-01",5.0000000000000001E-3,null,"2002-06-01",1.3299999999999999E-2,"2002-06-01","2002-06-01",1.3299999999999999E-2,null,"2002-06-01","2002-06-01","","","",1.3299999999999999E-2,1.3299999999999999E-2,2.0824999999999991,null,null,null,null,null,null,null,null,null,null,null,"",null,"2007-06-01",2.8999999999999998E-3,null,"2007-06-01",5.9587699999998911E-3]
[null,"2006-07-01",350,"2006-07-01",350,null,"2007-07-01",2.3999999999999998E-3,"2007-07-01",2.3999999999999998E-3,null,"2007-07-01",2.3999999999999998E-3,"2007-07-01",2.3999999999999998E-3,null,"2007-07-01",1.469E-3,"2007-07-01",1.469E-3,null,"2013-03-01",6.0000000000000001E-3,"2013-03-01",6.0000000000000001E-3,null,null,null,null,null,null,"2002-07-01",5.1279999999999997E-3,5.9379999999999997E-3,6.7400000000000003E-3,7.5360000000000002E-3,null,"2007-07-01",2.3999999999999998E-3,null,"2007-07-01",2.4659999999999999E-3,3.2729999999999999E-3,4.0740000000000004E-3,4.8669999999999998E-3,null,87,{"$error":"#REF!"},{"$error":"#REF!"},{"$error":"#REF!"},{"$error":"#REF!"},{"$error":"#REF!"},null,null,null,null,null,null,null,null,null,null,null,null,79,null,null,null,null,"2002-07-01",5.0000000000000001E-3,"2002-07-01",5.0000000000000001E-3,null,"2002-07-01",1.54E-2,"2002-07-01","2002-07-01",1.54E-2,null,"2002-07-01","2002-07-01","","","",1.54E-2,1.54E-2,2.067099999999999,null,null,null,null,null,null,null,null,null,null,null,"",null,"2007-07-01",2.3999999999999998E-3,null,"2007-07-01",6.4763449999998279E-3]
[null,"2006-08-01",350,"2006-08-01",350,null,"2007-08-01",4.1999999999999997E-3,"2007-08-01",4.1999999999999997E-3,null,"2007-08-01",4.7000000000000002E-3,"2007-08-01",4.7000000000000002E-3,null,"2007-08-01",1.4660000000000001E-3,"2007-08-01",1.4660000000000001E-3,null,"2013-04-01",5.8999999999999999E-3,"2013-04-01",5.8999999999999999E-3,null,null,null,null,null,null,"2002-08-01",4.9529999999999999E-3,5.7619999999999998E-3,6.5649999999999997E-3,7.3600000000000002E-3,null,"2007-08-01",4.1999999999999997E-3,null,"2007-08-01",2.4659999999999999E-3,3.2729999999999999E-3,4.0740000000000004E-3,4.8669999999999998E-3,null,88,{"$error":"#REF!"},{"$error":"#REF!"},{"$error":"#REF!"},{"$error":"#REF!"},{"$error":"#REF!"},null,null,null,null,null,null,null,null,null,null,null,null,80,null,null,null,null,"2002-08-01",5.0000000000000001E-3,"2002-08-01",5.0000000000000001E-3,null,"2002-08-01",1.44E-2,"2002-08-01","2002-08-01",1.44E-2,null,"2002-08-01","2002-08-01","","","",1.44E-2,1.44E-2,2.0526999999999989,null,null,null,null,null,null,null,null,null,null,null,"",null,"2007-08-01",4.1999999999999997E-3,null,"2007-08-01",6.4733299999999439E-3]
[null,"2006-09-01",350,"2006-09-01",350,null,"2007-09-01",2.8999999999999998E-3,"2007-09-01",2.8999999999999998E-3,null,"2007-09-01",1.8E-3,"2007-09-01",1.8E-3,null,"2007-09-01",3.5199999999999999E-4,"2007-09-01",3.5199999999999999E-4,null,"2013-05-01",3.5000000000000001E-3,"2013-05-01",3.5000000000000001E-3,null,null,null,null,null,null,"2002-09-01",4.4260000000000002E-3,5.2350000000000001E-3,6.0369999999999998E-3,6.8320000000000004E-3,null,"2007-09-01",2.8999999999999998E-3,null,"2007-09-01",2.4659999999999999E-3,3.2729999999999999E-3,4.0740000000000004E-3,4.8669999999999998E-3,null,89,{"$error":"#REF!"},{"$error":"#REF!"},{"$error":"#REF!"},{"$error":"#REF!"},{"$error":"#REF!"},null,null,null,null,null,null,null,null,null,null,null,null,81,null,null,null,null,"2002-09-01",5.0000000000000001E-3,"2002-09-01",5.0000000000000001E-3,null,"2002-09-01",1.38E-2,"2002-09-01","2002-09-01",1.38E-2,null,"2002-09-01","2002-09-01","","","",1.38E-2,1.38E-2,2.038899999999999,null,null,null,null,null,null,null,null,null,null,null,"",null,"2007-09-01",2.8999999999999998E-3,null,"2007-09-01",5.3537599999997632E-3]
[null,"2006-10-01",350,"2006-10-01",350,null,"2007-10-01",2.3999999999999998E-3,"2007-10-01",2.3999999999999998E-3,null,"2007-10-01",3.0000000000000001E-3,"2007-10-01",3.0000000000000001E-3,null,"2007-10-01",1.142E-3,"2007-10-01",1.142E-3,null,"2013-06-01",2.8E-3,"2013-06-01",2.8E-3,null,null,null,null,null,null,"2002-10-01",5.241E-3,6.0499999999999998E-3,6.8529999999999997E-3,7.6490000000000004E-3,null,"2007-10-01",2.3999999999999998E-3,null,"2007-10-01",2.4659999999999999E-3,3.2729999999999999E-3,4.0740000000000004E-3,4.8669999999999998E-3,null,90,{"$error":"#REF!"},{"$error":"#REF!"},{"$error":"#REF!"},{"$error":"#REF!"},{"$error":"#REF!"},null,null,null,null,null,null,null,null,null,null,null,null,82,null,null,null,null,"2002-10-01",5.0000000000000001E-3,"2002-10-01",5.0000000000000001E-3,null,"2002-10-01",1.6500000000000001E-2,"2002-10-01","2002-10-01",1.6500000000000001E-2,null,"2002-10-01","2002-10-01","","","",1.6500000000000001E-2,1.6500000000000001E-2,2.0223999999999989,null,null,null,null,null,null,null,null,null,null,null,"",null,"2007-10-01",2.3999999999999998E-3,null,"2007-10-01",6.1477099999998064E-3]
[null,"2006-11-01",350,"2006-11-01",350,null,"2007-11-01",2.3E-3,"2007-11-01",2.3E-3,null,"2007-11-01",3.8E-3,"2007-11-01",3.8E-3,null,"2007-11-01",5.9000000000000003E-4,"2007-11-01",5.9000000000000003E-4,null,"2013-07-01",-1.2999999999999999E-3,"2013-07-01",-1.2999999999999999E-3,null,null,null,null,null,null,"2002-11-01",5.1159999999999999E-3,5.9259999999999998E-3,6.7279999999999996E-3,7.5240000000000003E-3,null,"2007-11-01",2.3E-3,null,"2007-11-01",2.4659999999999999E-3,3.2729999999999999E-3,4.0740000000000004E-3,4.8669999999999998E-3,null,91,{"$error":"#REF!"},{"$error":"#REF!"},{"$error":"#REF!"},{"$error":"#REF!"},{"$error":"#REF!"},null,null,null,null,null,null,null,null,null,null,null,null,null,null,null,null,null,"2002-11-01",5.0000000000000001E-3,"2002-11-01",5.0000000000000001E-3,null,"2002-11-01",1.54E-2,"2002-11-01","2002-11-01",1.54E-2,null,"2002-11-01","2002-11-01","","","",1.54E-2,1.54E-2,2.0069999999999988,null,null,null,null,null,null,null,null,null,null,null,"",null,"2007-11-01",2.3E-3,null,"2007-11-01",5.5929500000000409E-3]
[null,"2006-12-01",350,"2006-12-01",350,null,"2007-12-01",7.0000000000000001E-3,"2007-12-01",7.0000000000000001E-3,null,"2007-12-01",7.4000000000000003E-3,"2007-12-01",7.4000000000000003E-3,null,"2007-12-01",6.4000000000000005E-4,"2007-12-01",6.4000000000000005E-4,null,"2013-08-01",1.6000000000000001E-3,"2013-08-01",1.6000000000000001E-3,null,null,null,null,null,null,"2002-12-01",6.084E-3,6.894E-3,7.6969999999999998E-3,8.4939999999999998E-3,null,"2007-12-01",7.0000000000000001E-3,null,"2007-12-01",2.4659999999999999E-3,3.2729999999999999E-3,4.0740000000000004E-3,4.8669999999999998E-3,null,92,{"$error":"#REF!"},{"$error":"#REF!"},{"$error":"#REF!"},{"$error":"#REF!"},{"$error":"#REF!"},null,null,null,null,null,null,null,null,null,null,null,null,null,null,null,null,null,"2002-12-01",5.0000000000000001E-3,"2002-12-01",5.0000000000000001E-3,null,"2002-12-01",1.7399999999999999E-2,"2002-12-01","2002-12-01",1.7399999999999999E-2,null,"2002-12-01","2002-12-01","","","",1.7399999999999999E-2,1.7399999999999999E-2,1.9895999999999987,null,null,null,null,null,null,null,null,null,null,null,"",null,"2007-12-01",7.0000000000000001E-3,null,"2007-12-01",5.6431999999999594E-3]
[null,"2007-01-01",350,"2007-01-01",350,null,"2008-01-01",7.0000000000000001E-3,"2008-01-01",7.0000000000000001E-3,null,"2008-01-01",5.4000000000000003E-3,"2008-01-01",5.4000000000000003E-3,null,"2008-01-01",1.01E-3,"2008-01-01",1.01E-3,null,"2013-09-01",2.7000000000000001E-3,"2013-09-01",2.7000000000000001E-3,null,null,null,null,null,null,"2003-01-01",7.3559999999999997E-3,8.1670000000000006E-3,8.9709999999999998E-3,9.7689999999999999E-3,null,"2008-01-01",7.0000000000000001E-3,null,"2008-01-01",2.4659999999999999E-3,3.2729999999999999E-3,4.0740000000000004E-3,4.8669999999999998E-3,null,93,{"$error":"#REF!"},{"$error":"#REF!"},{"$error":"#REF!"},{"$error":"#REF!"},{"$error":"#REF!"},null,null,null,null,null,null,null,null,null,null,null,null,null,null,null,null,null,"2003-01-01",5.0000000000000001E-3,"2003-01-01",5.0000000000000001E-3,null,"2003-01-01",1.9699999999999999E-2,"2003-01-01","2003-01-01",1.9699999999999999E-2,null,"2003-01-01","2003-01-01","","",{"$f":"+IF(OR(COD_JUROS<>3,CD92=\"\"),\"\",1%)","v":""},1.9699999999999999E-2,1.9699999999999999E-2,1.9698999999999987,null,null,null,null,null,null,null,null,null,null,null,"",null,"2008-01-01",7.0000000000000001E-3,null,"2008-01-01",6.0150499999997997E-3]
[null,"2007-02-01",350,"2007-02-01",350,null,"2008-02-01",6.4000000000000003E-3,"2008-02-01",6.4000000000000003E-3,null,"2008-02-01",4.8999999999999998E-3,"2008-02-01",4.8999999999999998E-3,null,"2008-02-01",2.43E-4,"2008-02-01",2.43E-4,null,"2013-10-01",6.1000000000000004E-3,"2013-10-01",6.1000000000000004E-3,null,null,null,null,null,null,"2003-02-01",6.5919999999999998E-3,7.4029999999999999E-3,8.2059999999999998E-3,9.0030000000000006E-3,null,"2008-02-01",6.4000000000000003E-3,null,"2008-02-01",2.4659999999999999E-3,3.2729999999999999E-3,4.0740000000000004E-3,4.8669999999999998E-3,null,94,{"$error":"#REF!"},{"$error":"#REF!"},{"$error":"#REF!"},{"$error":"#REF!"},{"$error":"#REF!"},null,null,null,null,null,null,null,null,null,null,null,null,null,null,null,null,null,"2003-02-01",5.0000000000000001E-3,"2003-02-01",5.0000000000000001E-3,null,"2003-02-01",1.83E-2,"2003-02-01","2003-02-01",1.83E-2,null,"2003-02-01","2003-02-01","","","",1.83E-2,1.83E-2,1.9515999999999987,null,null,null,null,null,null,null,null,null,null,null,"",null,"2008-02-01",6.4000000000000003E-3,null,"2008-02-01",5.24421499999983E-3]
[null,"2007-03-01",350,"2007-03-01",350,null,"2008-03-01",2.3E-3,"2008-03-01",2.3E-3,null,"2008-03-01",4.7999999999999996E-3,"2008-03-01",4.7999999999999996E-3,null,"2008-03-01",4.0900000000000002E-4,"2008-03-01",4.0900000000000002E-4,null,"2013-11-01",5.4000000000000003E-3,"2013-11-01",5.4000000000000003E-3,null,null,null,null,null,null,"2003-03-01",6.2570000000000004E-3,7.0679999999999996E-3,7.8709999999999995E-3,8.6669999999999994E-3,null,"2008-03-01",2.3E-3,null,"2008-03-01",2.4659999999999999E-3,3.2729999999999999E-3,4.0740000000000004E-3,4.8669999999999998E-3,null,95,{"$error":"#REF!"},{"$error":"#REF!"},{"$error":"#REF!"},{"$error":"#REF!"},{"$error":"#REF!"},null,null,null,null,null,null,null,null,null,null,null,null,null,null,null,null,null,"2003-03-01",5.0000000000000001E-3,"2003-03-01",5.0000000000000001E-3,null,"2003-03-01",1.78E-2,"2003-03-01","2003-03-01",1.78E-2,null,"2003-03-01","2003-03-01","","","",1.78E-2,1.78E-2,1.9337999999999986,null,null,null,null,null,null,null,null,null,null,null,"",null,"2008-03-01",2.3E-3,null,"2008-03-01",5.4110450000000032E-3]
[null,"2007-04-01",380,"2007-04-01",380,null,"2008-04-01",5.8999999999999999E-3,"2008-04-01",5.8999999999999999E-3,null,"2008-04-01",5.4999999999999997E-3,"2008-04-01",5.4999999999999997E-3,null,"2008-04-01",9.5500000000000001E-4,"2008-04-01",9.5500000000000001E-4,null,"2013-12-01",7.1999999999999998E-3,"2013-12-01",7.1999999999999998E-3,null,null,null,null,null,null,"2003-04-01",6.6600000000000001E-3,7.4710000000000002E-3,8.2749999999999994E-3,9.0709999999999992E-3,null,"2008-04-01",5.8999999999999999E-3,null,"2008-04-01",2.4659999999999999E-3,3.2729999999999999E-3,4.0740000000000004E-3,4.8669999999999998E-3,null,96,{"$error":"#REF!"},{"$error":"#REF!"},{"$error":"#REF!"},{"$error":"#REF!"},{"$error":"#REF!"},null,null,null,null,null,null,null,null,null,null,null,null,null,null,null,null,null,"2003-04-01",5.0000000000000001E-3,"2003-04-01",5.0000000000000001E-3,null,"2003-04-01",1.8700000000000001E-2,"2003-04-01","2003-04-01",1.8700000000000001E-2,null,"2003-04-01","2003-04-01","","","",1.8700000000000001E-2,1.8700000000000001E-2,1.9150999999999987,null,null,null,null,null,null,null,null,null,null,null,"",null,"2008-04-01",5.8999999999999999E-3,null,"2008-04-01",5.9597750000000005E-3]
[null,"2007-05-01",380,"2007-05-01",380,null,"2008-05-01",5.5999999999999999E-3,"2008-05-01",5.5999999999999999E-3,null,"2008-05-01",7.9000000000000008E-3,"2008-05-01",7.9000000000000008E-3,null,"2008-05-01",7.36E-4,"2008-05-01",7.36E-4,null,"2014-01-01",6.3E-3,"2014-01-01",6.3E-3,null,null,null,null,null,null,"2003-05-01",7.1269999999999997E-3,7.9380000000000006E-3,8.7430000000000008E-3,9.5399999999999999E-3,null,"2008-05-01",5.5999999999999999E-3,null,"2008-05-01",2.4659999999999999E-3,3.2729999999999999E-3,4.0740000000000004E-3,4.8669999999999998E-3,null,97,{"$error":"#REF!"},{"$error":"#REF!"},{"$error":"#REF!"},{"$error":"#REF!"},{"$error":"#REF!"},null,null,null,null,null,null,null,null,null,null,null,null,null,null,null,null,null,"2003-05-01",5.0000000000000001E-3,"2003-05-01",5.0000000000000001E-3,null,"2003-05-01",1.9699999999999999E-2,"2003-05-01","2003-05-01",1.9699999999999999E-2,null,"2003-05-01","2003-05-01","","","",1.9699999999999999E-2,1.9699999999999999E-2,1.8953999999999986,null,null,null,null,null,null,null,null,null,null,null,"",null,"2008-05-01",5.5999999999999999E-3,null,"2008-05-01",5.7396800000000248E-3]
[null,"2007-06-01",380,"2007-06-01",380,null,"2008-06-01",8.9999999999999993E-3,"2008-06-01",8.9999999999999993E-3,null,"2008-06-01",7.4000000000000003E-3,"2008-06-01",7.4000000000000003E-3,null,"2008-06-01",1.1460000000000001E-3,"2008-06-01",1.1460000000000001E-3,null,"2014-02-01",6.4000000000000003E-3,"2014-02-01",6.4000000000000003E-3,null,null,null,null,null,null,"2003-06-01",6.6420000000000003E-3,7.4530000000000004E-3,8.2570000000000005E-3,9.0530000000000003E-3,null,"2008-06-01",8.9999999999999993E-3,null,"2008-06-01",2.4659999999999999E-3,3.2729999999999999E-3,4.0740000000000004E-3,4.8669999999999998E-3,null,98,{"$error":"#REF!"},{"$error":"#REF!"},{"$error":"#REF!"},{"$error":"#REF!"},{"$error":"#REF!"},null,null,null,null,null,null,null,null,null,null,null,null,null,null,null,null,null,"2003-06-01",5.0000000000000001E-3,"2003-06-01",5.0000000000000001E-3,null,"2003-06-01",1.8599999999999998E-2,"2003-06-01","2003-06-01",1.8599999999999998E-2,null,"2003-06-01","2003-06-01","","","",1.8599999999999998E-2,1.8599999999999998E-2,1.8767999999999987,null,null,null,null,null,null,null,null,null,null,null,"",null,"2008-06-01",8.9999999999999993E-3,null,"2008-06-01",6.1517300000000219E-3]
[null,"2007-07-01",380,"2007-07-01",380,null,"2008-07-01",6.3E-3,"2008-07-01",6.3E-3,null,"2008-07-01",5.3E-3,"2008-07-01",5.3E-3,null,"2008-07-01",1.9139999999999999E-3,"2008-07-01",1.9139999999999999E-3,null,"2014-03-01",8.2000000000000007E-3,"2014-03-01",8.2000000000000007E-3,null,null,null,null,null,null,"2003-07-01",7.9439999999999997E-3,8.7559999999999999E-3,9.5610000000000001E-3,1.0359E-2,null,"2008-07-01",6.3E-3,null,"2008-07-01",2.4659999999999999E-3,3.2729999999999999E-3,4.0740000000000004E-3,4.8669999999999998E-3,null,99,{"$error":"#REF!"},{"$error":"#REF!"},{"$error":"#REF!"},{"$error":"#REF!"},{"$error":"#REF!"},null,null,null,null,null,null,null,null,null,null,null,null,null,null,null,null,null,"2003-07-01",5.0000000000000001E-3,"2003-07-01",5.0000000000000001E-3,null,"2003-07-01",2.0799999999999999E-2,"2003-07-01","2003-07-01",2.0799999999999999E-2,null,"2003-07-01","2003-07-01","","","",2.0799999999999999E-2,2.0799999999999999E-2,1.8559999999999988,null,null,null,null,null,null,null,null,null,null,null,"",null,"2008-07-01",6.3E-3,null,"2008-07-01",6.923569999999879E-3]
[null,"2007-08-01",380,"2007-08-01",380,null,"2008-08-01",3.5000000000000001E-3,"2008-08-01",3.5000000000000001E-3,null,"2008-08-01",2.8E-3,"2008-08-01",2.8E-3,null,"2008-08-01",1.5740000000000001E-3,"2008-08-01",1.5740000000000001E-3,null,"2014-04-01",7.7999999999999996E-3,"2014-04-01",7.7999999999999996E-3,null,null,null,null,null,null,"2003-08-01",6.5139999999999998E-3,7.3239999999999998E-3,8.1279999999999998E-3,8.9250000000000006E-3,null,"2008-08-01",3.5000000000000001E-3,null,"2008-08-01",2.4659999999999999E-3,3.2729999999999999E-3,4.0740000000000004E-3,4.8669999999999998E-3,null,100,{"$error":"#REF!"},{"$error":"#REF!"},{"$error":"#REF!"},{"$error":"#REF!"},{"$error":"#REF!"},null,null,null,null,null,null,null,null,null,null,null,null,null,null,null,null,null,"2003-08-01",5.0000000000000001E-3,"2003-08-01",5.0000000000000001E-3,null,"2003-08-01",1.77E-2,"2003-08-01","2003-08-01",1.77E-2,null,"2003-08-01","2003-08-01","","","",1.77E-2,1.77E-2,1.8382999999999987,null,null,null,null,null,null,null,null,null,null,null,"",null,"2008-08-01",3.5000000000000001E-3,null,"2008-08-01",6.5818699999997676E-3]
[null,"2007-09-01",380,"2007-09-01",380,null,"2008-09-01",2.5999999999999999E-3,"2008-09-01",2.5999999999999999E-3,null,"2008-09-01",2.5999999999999999E-3,"2008-09-01",2.5999999999999999E-3,null,"2008-09-01",1.97E-3,"2008-09-01",1.97E-3,null,"2014-05-01",6.0000000000000001E-3,"2014-05-01",6.0000000000000001E-3,null,null,null,null,null,null,"2003-09-01",5.8380000000000003E-3,6.6480000000000003E-3,7.4510000000000002E-3,8.2470000000000009E-3,null,"2008-09-01",2.5999999999999999E-3,null,"2008-09-01",2.4659999999999999E-3,3.2729999999999999E-3,4.0740000000000004E-3,4.8669999999999998E-3,null,101,{"$error":"#REF!"},{"$error":"#REF!"},{"$error":"#REF!"},{"$error":"#REF!"},{"$error":"#REF!"},null,null,null,null,null,null,null,null,null,null,null,null,null,null,null,null,null,"2003-09-01",5.0000000000000001E-3,"2003-09-01",5.0000000000000001E-3,null,"2003-09-01",1.6799999999999999E-2,"2003-09-01","2003-09-01",1.6799999999999999E-2,null,"2003-09-01","2003-09-01","","","",1.6799999999999999E-2,1.6799999999999999E-2,1.8214999999999988,null,null,null,null,null,null,null,null,null,null,null,"",null,"2008-09-01",2.5999999999999999E-3,null,"2008-09-01",6.9798500000000097E-3]
[null,"2007-10-01",380,"2007-10-01",380,null,"2008-10-01",3.0000000000000001E-3,"2008-10-01",3.0000000000000001E-3,null,"2008-10-01",4.4999999999999997E-3,"2008-10-01",4.4999999999999997E-3,null,"2008-10-01",2.506E-3,"2008-10-01",2.506E-3,null,"2014-06-01",2.5999999999999999E-3,"2014-06-01",2.5999999999999999E-3,null,null,null,null,null,null,"2003-10-01",5.6870000000000002E-3,6.4970000000000002E-3,7.3000000000000001E-3,8.0960000000000008E-3,null,"2008-10-01",3.0000000000000001E-3,null,"2008-10-01",2.4659999999999999E-3,3.2729999999999999E-3,4.0740000000000004E-3,4.8669999999999998E-3,null,102,{"$error":"#REF!"},{"$error":"#REF!"},{"$error":"#REF!"},{"$error":"#REF!"},{"$error":"#REF!"},null,null,null,null,null,null,null,null,null,null,null,null,null,null,null,null,null,"2003-10-01",5.0000000000000001E-3,"2003-10-01",5.0000000000000001E-3,null,"2003-10-01",1.6400000000000001E-2,"2003-10-01","2003-10-01",1.6400000000000001E-2,null,"2003-10-01","2003-10-01","","","",1.6400000000000001E-2,1.6400000000000001E-2,1.8050999999999988,null,null,null,null,null,null,null,null,null,null,null,"",null,"2008-10-01",3.0000000000000001E-3,null,"2008-10-01",7.5185299999998012E-3]
[null,"2007-11-01",380,"2007-11-01",380,null,"2008-11-01",4.8999999999999998E-3,"2008-11-01",4.8999999999999998E-3,null,"2008-11-01",3.5999999999999999E-3,"2008-11-01",3.5999999999999999E-3,null,"2008-11-01",1.6180000000000001E-3,"2008-11-01",1.6180000000000001E-3,null,"2014-07-01",1.2999999999999999E-3,"2014-07-01",1.2999999999999999E-3,null,null,null,null,null,null,"2003-11-01",4.2459999999999998E-3,5.0549999999999996E-3,5.8570000000000002E-3,6.6519999999999999E-3,null,"2008-11-01",4.8999999999999998E-3,null,"2008-11-01",2.4659999999999999E-3,3.2729999999999999E-3,4.0740000000000004E-3,4.8669999999999998E-3,null,103,{"$error":"#REF!"},{"$error":"#REF!"},{"$error":"#REF!"},{"$error":"#REF!"},{"$error":"#REF!"},null,null,null,null,null,null,null,null,null,null,null,null,null,null,null,null,null,"2003-11-01",5.0000000000000001E-3,"2003-11-01",5.0000000000000001E-3,null,"2003-11-01",1.34E-2,"2003-11-01","2003-11-01",1.34E-2,null,"2003-11-01","2003-11-01","","","",1.34E-2,1.34E-2,1.7916999999999987,null,null,null,null,null,null,null,null,null,null,null,"",null,"2008-11-01",4.8999999999999998E-3,null,"2008-11-01",6.6260899999996958E-3]
[null,"2007-12-01",380,"2007-12-01",380,null,"2008-12-01",2.8999999999999998E-3,"2008-12-01",2.8999999999999998E-3,null,"2008-12-01",2.8E-3,"2008-12-01",2.8E-3,null,"2008-12-01",2.1489999999999999E-3,"2008-12-01",2.1489999999999999E-3,null,"2014-08-01",1.8E-3,"2014-08-01",1.8E-3,null,null,null,null,null,null,"2003-12-01",4.3689999999999996E-3,5.1780000000000003E-3,5.9800000000000001E-3,6.7749999999999998E-3,null,"2008-12-01",2.8999999999999998E-3,null,"2008-12-01",2.4659999999999999E-3,3.2729999999999999E-3,4.0740000000000004E-3,4.8669999999999998E-3,null,104,{"$error":"#REF!"},{"$error":"#REF!"},{"$error":"#REF!"},{"$error":"#REF!"},{"$error":"#REF!"},null,null,null,null,null,null,null,null,null,null,null,null,null,null,null,null,null,"2003-12-01",5.0000000000000001E-3,"2003-12-01",5.0000000000000001E-3,null,"2003-12-01",1.37E-2,"2003-12-01","2003-12-01",1.37E-2,null,"2003-12-01","2003-12-01","","","",1.37E-2,1.37E-2,1.7779999999999987,null,null,null,null,null,null,null,null,null,null,null,"",null,"2008-12-01",2.8999999999999998E-3,null,"2008-12-01",7.1597449999998286E-3]
[null,"2008-01-01",380,"2008-01-01",380,null,"2009-01-01",4.0000000000000001E-3,"2009-01-01",4.0000000000000001E-3,null,"2009-01-01",4.7999999999999996E-3,"2009-01-01",4.7999999999999996E-3,null,"2009-01-01",1.8400000000000001E-3,"2009-01-01",1.8400000000000001E-3,null,"2014-09-01",4.8999999999999998E-3,"2014-09-01",4.8999999999999998E-3,null,null,null,null,null,null,"2004-01-01",3.7490000000000002E-3,4.5570000000000003E-3,5.359E-3,6.1529999999999996E-3,null,{"$f":"+I105","v":"2009-01-01"},{"$f":"+J105","v":4.0000000000000001E-3},null,"2009-01-01",2.4659999999999999E-3,3.2729999999999999E-3,4.0740000000000004E-3,4.8669999999999998E-3,null,105,{"$error":"#REF!"},{"$error":"#REF!"},{"$error":"#REF!"},{"$error":"#REF!"},{"$error":"#REF!"},null,null,null,null,null,null,null,null,null,null,null,null,null,null,null,null,null,"2004-01-01",5.0000000000000001E-3,"2004-01-01",5.0000000000000001E-3,null,"2004-01-01",1.2699999999999999E-2,"2004-01-01","2004-01-01",1.2699999999999999E-2,null,"2004-01-01","2004-01-01","","","",1.2699999999999999E-2,1.2699999999999999E-2,1.7652999999999988,null,null,null,null,null,null,null,null,null,null,null,"",null,{"$f":"+I105","v":"2009-01-01"},{"$f":"+J105","v":4.0000000000000001E-3},null,"2009-01-01",6.8491999999999997E-3]
[null,"2008-02-01",380,"2008-02-01",380,null,"2009-02-01",6.3E-3,"2009-02-01",6.3E-3,null,"2009-02-01",5.4999999999999997E-3,"2009-02-01",5.4999999999999997E-3,null,"2009-02-01",4.5100000000000001E-4,"2009-02-01",4.5100000000000001E-4,null,"2014-10-01",3.8E-3,"2014-10-01",3.8E-3,null,null,null,null,null,null,"2004-02-01",2.9250000000000001E-3,3.7330000000000002E-3,4.5329999999999997E-3,5.3270000000000001E-3,null,"2009-02-01",6.3E-3,null,"2009-02-01",2.4659999999999999E-3,3.2729999999999999E-3,4.0740000000000004E-3,4.8669999999999998E-3,null,106,{"$error":"#REF!"},{"$error":"#REF!"},{"$error":"#REF!"},{"$error":"#REF!"},{"$error":"#REF!"},null,null,null,null,null,null,null,null,null,null,null,null,null,null,null,null,null,"2004-02-01",5.0000000000000001E-3,"2004-02-01",5.0000000000000001E-3,null,"2004-02-01",1.0800000000000001E-2,"2004-02-01","2004-02-01",1.0800000000000001E-2,null,"2004-02-01","2004-02-01","","","",1.0800000000000001E-2,1.0800000000000001E-2,1.7544999999999988,null,null,null,null,null,null,null,null,null,null,null,"",null,"2009-02-01",6.3E-3,null,"2009-02-01",5.4532549999999347E-3]
[null,"2008-03-01",415,"2008-03-01",415,null,"2009-03-01",1.1000000000000001E-3,"2009-03-01",1.1000000000000001E-3,null,"2009-03-01",2E-3,"2009-03-01",2E-3,null,"2009-03-01",1.438E-3,"2009-03-01",1.438E-3,null,"2014-11-01",5.3E-3,"2014-11-01",5.3E-3,null,null,null,null,null,null,"2004-03-01",4.248E-3,5.0569999999999999E-3,5.8589999999999996E-3,6.6540000000000002E-3,null,"2009-03-01",1.1000000000000001E-3,null,"2009-03-01",2.4659999999999999E-3,3.2729999999999999E-3,4.0740000000000004E-3,4.8669999999999998E-3,null,107,{"$error":"#REF!"},{"$error":"#REF!"},{"$error":"#REF!"},{"$error":"#REF!"},{"$error":"#REF!"},null,null,null,null,null,null,null,null,null,null,null,null,null,null,null,null,null,"2004-03-01",5.0000000000000001E-3,"2004-03-01",5.0000000000000001E-3,null,"2004-03-01",1.38E-2,"2004-03-01","2004-03-01",1.38E-2,null,"2004-03-01","2004-03-01","","","",1.38E-2,1.38E-2,1.7406999999999988,null,null,null,null,null,null,null,null,null,null,null,"",null,"2009-03-01",1.1000000000000001E-3,null,"2009-03-01",6.4451899999999895E-3]
[null,"2008-04-01",415,"2008-04-01",415,null,"2009-04-01",3.5999999999999999E-3,"2009-04-01",3.5999999999999999E-3,null,"2009-04-01",4.7999999999999996E-3,"2009-04-01",4.7999999999999996E-3,null,"2009-04-01",4.5399999999999998E-4,"2009-04-01",4.5399999999999998E-4,null,"2014-12-01",6.1999999999999998E-3,"2014-12-01",6.1999999999999998E-3,null,null,null,null,null,null,"2004-04-01",3.3419999999999999E-3,4.15E-3,4.9509999999999997E-3,5.7450000000000001E-3,null,"2009-04-01",3.5999999999999999E-3,null,"2009-04-01",2.4659999999999999E-3,3.2729999999999999E-3,4.0740000000000004E-3,4.8669999999999998E-3,null,108,{"$error":"#REF!"},{"$error":"#REF!"},{"$error":"#REF!"},{"$error":"#REF!"},{"$error":"#REF!"},null,null,null,null,null,null,null,null,null,null,null,null,null,null,null,null,null,"2004-04-01",5.0000000000000001E-3,"2004-04-01",5.0000000000000001E-3,null,"2004-04-01",1.18E-2,"2004-04-01","2004-04-01",1.18E-2,null,"2004-04-01","2004-04-01","","","",1.18E-2,1.18E-2,1.7288999999999988,null,null,null,null,null,null,null,null,null,null,null,"",null,"2009-04-01",3.5999999999999999E-3,null,"2009-04-01",5.4562699999998188E-3]
[null,"2008-05-01",415,"2008-05-01",415,null,"2009-05-01",5.8999999999999999E-3,"2009-05-01",5.8999999999999999E-3,null,"2009-05-01",4.7000000000000002E-3,"2009-05-01",4.7000000000000002E-3,null,"2009-05-01",4.4900000000000002E-4,"2009-05-01",4.4900000000000002E-4,null,"2015-01-01",1.4800000000000001E-2,"2015-01-01",1.4800000000000001E-2,null,null,null,null,null,null,"2004-05-01",4.0159999999999996E-3,4.8240000000000002E-3,5.6259999999999999E-3,6.4209999999999996E-3,null,"2009-05-01",5.8999999999999999E-3,null,"2009-05-01",2.4659999999999999E-3,3.2729999999999999E-3,4.0740000000000004E-3,4.8669999999999998E-3,null,109,{"$error":"#REF!"},{"$error":"#REF!"},{"$error":"#REF!"},{"$error":"#REF!"},{"$error":"#REF!"},null,null,null,null,null,null,null,null,null,null,null,null,null,null,null,null,null,"2004-05-01",5.0000000000000001E-3,"2004-05-01",5.0000000000000001E-3,null,"2004-05-01",1.23E-2,"2004-05-01","2004-05-01",1.23E-2,null,"2004-05-01","2004-05-01","","","",1.23E-2,1.23E-2,1.7165999999999988,null,null,null,null,null,null,null,null,null,null,null,"",null,"2009-05-01",5.8999999999999999E-3,null,"2009-05-01",5.4512449999997159E-3]
[null,"2008-06-01",415,"2008-06-01",415,null,"2009-06-01",3.8E-3,"2009-06-01",3.8E-3,null,"2009-06-01",3.5999999999999999E-3,"2009-06-01",3.5999999999999999E-3,null,"2009-06-01",6.5600000000000001E-4,"2009-06-01",6.5600000000000001E-4,null,"2015-02-01",1.1599999999999999E-2,"2015-02-01",1.1599999999999999E-2,null,null,null,null,null,null,"2004-06-01",4.2310000000000004E-3,5.0400000000000002E-3,5.842E-3,6.6369999999999997E-3,null,"2009-06-01",3.8E-3,null,"2009-06-01",2.4659999999999999E-3,3.2729999999999999E-3,4.0740000000000004E-3,4.8669999999999998E-3,null,110,{"$error":"#REF!"},{"$error":"#REF!"},{"$error":"#REF!"},{"$error":"#REF!"},{"$error":"#REF!"},null,null,null,null,null,null,null,null,null,null,null,null,null,null,null,null,null,"2004-06-01",5.0000000000000001E-3,"2004-06-01",5.0000000000000001E-3,null,"2004-06-01",1.23E-2,"2004-06-01","2004-06-01",1.23E-2,null,"2004-06-01","2004-06-01","","","",1.23E-2,1.23E-2,1.7042999999999988,null,null,null,null,null,null,null,null,null,null,null,"",null,"2009-06-01",3.8E-3,null,"2009-06-01",5.6592799999999333E-3]
[null,"2008-07-01",415,"2008-07-01",415,null,"2009-07-01",2.2000000000000001E-3,"2009-07-01",2.2000000000000001E-3,null,"2009-07-01",2.3999999999999998E-3,"2009-07-01",2.3999999999999998E-3,null,"2009-07-01",1.0510000000000001E-3,"2009-07-01",1.0510000000000001E-3,null,"2015-03-01",1.5100000000000001E-2,"2015-03-01",1.5100000000000001E-2,null,null,null,null,null,null,"2004-07-01",4.4229999999999998E-3,5.2319999999999997E-3,6.0340000000000003E-3,6.829E-3,null,{"$f":"+S111","v":"2009-07-01"},{"$f":"+T111","v":1.0510000000000001E-3},null,"2009-07-01",2.4659999999999999E-3,3.2729999999999999E-3,4.0740000000000004E-3,4.8669999999999998E-3,null,111,{"$error":"#REF!"},{"$error":"#REF!"},{"$error":"#REF!"},{"$error":"#REF!"},{"$error":"#REF!"},null,null,null,null,null,null,null,null,null,null,null,null,null,null,null,null,null,"2004-07-01",5.0000000000000001E-3,"2004-07-01",5.0000000000000001E-3,null,"2004-07-01",1.29E-2,"2004-07-01","2004-07-01",1.29E-2,null,"2004-07-01","2004-07-01","","","",1.29E-2,1.29E-2,1.6913999999999989,null,null,null,null,null,null,null,null,null,null,null,"",null,{"$f":"+S111","v":"2009-07-01"},{"$f":"+T111","v":1.0510000000000001E-3},null,"2009-07-01",6.0562549999998438E-3]
[null,"2008-08-01",415,"2008-08-01",415,null,"2009-08-01",2.3E-3,"2009-08-01",2.3E-3,null,"2009-08-01",1.5E-3,"2009-08-01",1.5E-3,null,"2009-08-01",1.9699999999999999E-4,"2009-08-01",1.9699999999999999E-4,null,"2015-04-01",7.1000000000000004E-3,"2015-04-01",7.1000000000000004E-3,null,null,null,null,null,null,"2004-08-01",4.4759999999999999E-3,5.2849999999999998E-3,6.0870000000000004E-3,6.8820000000000001E-3,null,"2009-08-01",1.9699999999999999E-4,null,"2009-08-01",2.4659999999999999E-3,3.2729999999999999E-3,4.0740000000000004E-3,4.8669999999999998E-3,null,112,{"$error":"#REF!"},{"$error":"#REF!"},{"$error":"#REF!"},{"$error":"#REF!"},{"$error":"#REF!"},null,null,null,null,null,null,null,null,null,null,null,null,null,null,null,null,null,"2004-08-01",5.0000000000000001E-3,"2004-08-01",5.0000000000000001E-3,null,"2004-08-01",1.29E-2,"2004-08-01","2004-08-01",1.29E-2,null,"2004-08-01","2004-08-01","","","",1.29E-2,1.29E-2,1.678499999999999,null,null,null,null,null,null,null,null,null,null,null,"",null,"2009-08-01",1.9699999999999999E-4,null,"2009-08-01",5.197984999999905E-3]
[null,"2008-09-01",415,"2008-09-01",415,null,"2009-09-01",1.9E-3,"2009-09-01",1.9E-3,null,"2009-09-01",2.3999999999999998E-3,"2009-09-01",2.3999999999999998E-3,null,"2009-09-01",0,"2009-09-01",0,null,"2015-05-01",9.9000000000000008E-3,"2015-05-01",9.9000000000000008E-3,null,null,null,null,null,null,"2004-09-01",4.1980000000000003E-3,5.0070000000000002E-3,5.8089999999999999E-3,6.6030000000000004E-3,null,"2009-09-01",0,null,"2009-09-01",2.4659999999999999E-3,3.2729999999999999E-3,4.0740000000000004E-3,4.8669999999999998E-3,null,113,{"$error":"#REF!"},{"$error":"#REF!"},{"$error":"#REF!"},{"$error":"#REF!"},{"$error":"#REF!"},null,null,null,null,null,null,null,null,null,null,null,null,null,null,null,null,null,"2004-09-01",5.0000000000000001E-3,"2004-09-01",5.0000000000000001E-3,null,"2004-09-01",1.2500000000000001E-2,"2004-09-01","2004-09-01",1.2500000000000001E-2,null,"2004-09-01","2004-09-01","","","",1.2500000000000001E-2,1.2500000000000001E-2,1.665999999999999,null,null,null,null,null,null,null,null,null,null,null,"",null,"2009-09-01",0,null,"2009-09-01",4.9999999999998934E-3]
[null,"2008-10-01",415,"2008-10-01",415,null,"2009-10-01",1.8E-3,"2009-10-01",1.8E-3,null,"2009-10-01",2.8E-3,"2009-10-01",2.8E-3,null,"2009-10-01",0,"2009-10-01",0,null,"2015-06-01",7.7000000000000002E-3,"2015-06-01",7.7000000000000002E-3,null,null,null,null,null,null,"2004-10-01",3.5760000000000002E-3,4.385E-3,5.1859999999999996E-3,5.9800000000000001E-3,null,"2009-10-01",0,null,"2009-10-01",2.4659999999999999E-3,3.2729999999999999E-3,4.0740000000000004E-3,4.8669999999999998E-3,null,114,{"$error":"#REF!"},{"$error":"#REF!"},{"$error":"#REF!"},{"$error":"#REF!"},{"$error":"#REF!"},null,null,null,null,null,null,null,null,null,null,null,null,null,null,null,null,null,"2004-10-01",5.0000000000000001E-3,"2004-10-01",5.0000000000000001E-3,null,"2004-10-01",1.21E-2,"2004-10-01","2004-10-01",1.21E-2,null,"2004-10-01","2004-10-01","","","",1.21E-2,1.21E-2,1.653899999999999,null,null,null,null,null,null,null,null,null,null,null,"",null,"2009-10-01",0,null,"2009-10-01",4.9999999999998934E-3]
[null,"2008-11-01",415,"2008-11-01",415,null,"2009-11-01",4.4000000000000003E-3,"2009-11-01",4.4000000000000003E-3,null,"2009-11-01",4.1000000000000003E-3,"2009-11-01",4.1000000000000003E-3,null,"2009-11-01",0,"2009-11-01",0,null,"2015-07-01",5.7999999999999996E-3,"2015-07-01",5.7999999999999996E-3,null,null,null,null,null,null,"2004-11-01",3.6150000000000002E-3,4.4229999999999998E-3,5.2240000000000003E-3,6.019E-3,null,"2009-11-01",0,null,"2009-11-01",2.4659999999999999E-3,3.2729999999999999E-3,4.0740000000000004E-3,4.8669999999999998E-3,null,115,{"$error":"#REF!"},{"$error":"#REF!"},{"$error":"#REF!"},{"$error":"#REF!"},{"$error":"#REF!"},null,null,null,null,null,null,null,null,null,null,null,null,null,null,null,null,null,"2004-11-01",5.0000000000000001E-3,"2004-11-01",5.0000000000000001E-3,null,"2004-11-01",1.2500000000000001E-2,"2004-11-01","2004-11-01",1.2500000000000001E-2,null,"2004-11-01","2004-11-01","","","",1.2500000000000001E-2,1.2500000000000001E-2,1.6413999999999991,null,null,null,null,null,null,null,null,null,null,null,"",null,"2009-11-01",0,null,"2009-11-01",4.9999999999998934E-3]
[null,"2008-12-01",415,"2008-12-01",415,null,"2009-12-01",3.8E-3,"2009-12-01",3.8E-3,null,"2009-12-01",3.7000000000000002E-3,"2009-12-01",3.7000000000000002E-3,null,"2009-12-01",5.3300000000000005E-4,"2009-12-01",5.3300000000000005E-4,null,"2015-08-01",2.5000000000000001E-3,"2015-08-01",2.5000000000000001E-3,null,null,null,null,null,null,"2004-12-01",4.8719999999999996E-3,5.6810000000000003E-3,6.483E-3,7.2789999999999999E-3,null,"2009-12-01",5.3300000000000005E-4,null,"2009-12-01",2.4659999999999999E-3,3.2729999999999999E-3,4.0740000000000004E-3,4.8669999999999998E-3,null,116,{"$error":"#REF!"},{"$error":"#REF!"},{"$error":"#REF!"},{"$error":"#REF!"},{"$error":"#REF!"},null,null,null,null,null,null,null,null,null,null,null,null,null,null,null,null,null,"2004-12-01",5.0000000000000001E-3,"2004-12-01",5.0000000000000001E-3,null,"2004-12-01",1.4800000000000001E-2,"2004-12-01","2004-12-01",1.4800000000000001E-2,null,"2004-12-01","2004-12-01","","","",1.4800000000000001E-2,1.4800000000000001E-2,1.6265999999999992,null,null,null,null,null,null,null,null,null,null,null,"",null,"2009-12-01",5.3300000000000005E-4,null,"2009-12-01",5.5356649999998009E-3]
[null,"2009-01-01",415,"2009-01-01",415,null,"2010-01-01",5.1999999999999998E-3,"2010-01-01",5.1999999999999998E-3,null,"2010-01-01",7.4999999999999997E-3,"2010-01-01",7.4999999999999997E-3,null,"2010-01-01",0,"2010-01-01",0,null,"2015-09-01",5.1000000000000004E-3,"2015-09-01",5.1000000000000004E-3,null,null,null,null,null,null,"2005-01-01",4.3499999999999997E-3,5.1590000000000004E-3,5.9610000000000002E-3,6.7559999999999999E-3,null,"2010-01-01",0,null,"2010-01-01",2.4659999999999999E-3,3.2729999999999999E-3,4.0740000000000004E-3,4.8669999999999998E-3,null,117,{"$error":"#REF!"},{"$error":"#REF!"},{"$error":"#REF!"},{"$error":"#REF!"},{"$error":"#REF!"},null,null,null,null,null,null,null,null,null,null,null,null,null,null,null,null,null,"2005-01-01",5.0000000000000001E-3,"2005-01-01",5.0000000000000001E-3,null,"2005-01-01",1.38E-2,"2005-01-01","2005-01-01",1.38E-2,null,"2005-01-01","2005-01-01","","","",1.38E-2,1.38E-2,1.6127999999999991,null,null,null,null,null,null,null,null,null,null,null,"",null,"2010-01-01",0,null,"2010-01-01",4.9999999999998934E-3]
[null,"2009-02-01",465,"2009-02-01",465,null,"2010-02-01",9.4000000000000004E-3,"2010-02-01",9.4000000000000004E-3,null,"2010-02-01",7.7999999999999996E-3,"2010-02-01",7.7999999999999996E-3,null,"2010-02-01",0,"2010-02-01",0,null,"2015-10-01",7.7000000000000002E-3,"2015-10-01",7.7000000000000002E-3,null,null,null,null,null,null,"2005-02-01",3.4299999999999999E-3,4.2379999999999996E-3,5.0400000000000002E-3,5.8339999999999998E-3,null,"2010-02-01",0,null,"2010-02-01",2.4659999999999999E-3,3.2729999999999999E-3,4.0740000000000004E-3,4.8669999999999998E-3,null,118,{"$error":"#REF!"},{"$error":"#REF!"},{"$error":"#REF!"},{"$error":"#REF!"},{"$error":"#REF!"},null,null,null,null,null,null,null,null,null,null,null,null,null,null,null,null,null,"2005-02-01",5.0000000000000001E-3,"2005-02-01",5.0000000000000001E-3,null,"2005-02-01",1.2200000000000001E-2,"2005-02-01","2005-02-01",1.2200000000000001E-2,null,"2005-02-01","2005-02-01","","","",1.2200000000000001E-2,1.2200000000000001E-2,1.6005999999999991,null,null,null,null,null,null,null,null,null,null,null,"",null,"2010-02-01",0,null,"2010-02-01",4.9999999999998934E-3]
[null,"2009-03-01",465,"2009-03-01",465,null,"2010-03-01",5.4999999999999997E-3,"2010-03-01",5.4999999999999997E-3,null,"2010-03-01",5.1999999999999998E-3,"2010-03-01",5.1999999999999998E-3,null,"2010-03-01",7.9199999999999995E-4,"2010-03-01",7.9199999999999995E-4,null,"2015-11-01",1.11E-2,"2015-11-01",1.11E-2,null,null,null,null,null,null,"2005-03-01",5.1070000000000004E-3,5.9170000000000004E-3,6.7190000000000001E-3,7.515E-3,null,"2010-03-01",7.9199999999999995E-4,null,"2010-03-01",2.4659999999999999E-3,3.2729999999999999E-3,4.0740000000000004E-3,4.8669999999999998E-3,null,119,{"$error":"#REF!"},{"$error":"#REF!"},{"$error":"#REF!"},{"$error":"#REF!"},{"$error":"#REF!"},null,null,null,null,null,null,null,null,null,null,null,null,null,null,null,null,null,"2005-03-01",5.0000000000000001E-3,"2005-03-01",5.0000000000000001E-3,null,"2005-03-01",1.5299999999999999E-2,"2005-03-01","2005-03-01",1.5299999999999999E-2,null,"2005-03-01","2005-03-01","","","",1.5299999999999999E-2,1.5299999999999999E-2,1.585299999999999,null,null,null,null,null,null,null,null,null,null,null,"",null,"2010-03-01",7.9199999999999995E-4,null,"2010-03-01",5.7959599999997113E-3]
[null,"2009-04-01",465,"2009-04-01",465,null,"2010-04-01",4.7999999999999996E-3,"2010-04-01",4.7999999999999996E-3,null,"2010-04-01",5.7000000000000002E-3,"2010-04-01",5.7000000000000002E-3,null,"2010-04-01",0,"2010-04-01",0,null,"2015-12-01",8.9999999999999993E-3,"2015-12-01",8.9999999999999993E-3,null,null,null,null,null,null,"2005-04-01",4.4739999999999997E-3,5.2830000000000004E-3,6.0850000000000001E-3,6.8799999999999998E-3,null,"2010-04-01",0,null,"2010-04-01",2.4659999999999999E-3,3.2729999999999999E-3,4.0740000000000004E-3,4.8669999999999998E-3,null,120,{"$error":"#REF!"},{"$error":"#REF!"},{"$error":"#REF!"},{"$error":"#REF!"},{"$error":"#REF!"},null,null,null,null,null,null,null,null,null,null,null,null,null,null,null,null,null,"2005-04-01",5.0000000000000001E-3,"2005-04-01",5.0000000000000001E-3,null,"2005-04-01",1.41E-2,"2005-04-01","2005-04-01",1.41E-2,null,"2005-04-01","2005-04-01","","","",1.41E-2,1.41E-2,1.571199999999999,null,null,null,null,null,null,null,null,null,null,null,"",null,"2010-04-01",0,null,"2010-04-01",4.9999999999998934E-3]
[null,"2009-05-01",465,"2009-05-01",465,null,"2010-05-01",6.3E-3,"2010-05-01",6.3E-3,null,"2010-05-01",4.3E-3,"2010-05-01",4.3E-3,null,"2010-05-01",5.1000000000000004E-4,"2010-05-01",5.1000000000000004E-4,null,"2016-01-01",1.5100000000000001E-2,"2016-01-01",1.5100000000000001E-2,null,null,null,null,null,null,"2005-05-01",4.999E-3,5.8089999999999999E-3,6.6109999999999997E-3,7.4060000000000003E-3,null,"2010-05-01",5.1000000000000004E-4,null,"2010-05-01",2.4659999999999999E-3,3.2729999999999999E-3,4.0740000000000004E-3,4.8669999999999998E-3,null,121,{"$error":"#REF!"},{"$error":"#REF!"},{"$error":"#REF!"},{"$error":"#REF!"},{"$error":"#REF!"},null,null,null,null,null,null,null,null,null,null,null,null,null,null,null,null,null,"2005-05-01",5.0000000000000001E-3,"2005-05-01",5.0000000000000001E-3,null,"2005-05-01",1.4999999999999999E-2,"2005-05-01","2005-05-01",1.4999999999999999E-2,null,"2005-05-01","2005-05-01","","","",1.4999999999999999E-2,1.4999999999999999E-2,1.5561999999999991,null,null,null,null,null,null,null,null,null,null,null,"",null,"2010-05-01",5.1000000000000004E-4,null,"2010-05-01",5.5125499999999494E-3]
[null,"2009-06-01",465,"2009-06-01",465,null,"2010-06-01",1.9E-3,"2010-06-01",1.9E-3,null,"2010-06-01",0,"2010-06-01",0,null,"2010-06-01",5.8900000000000001E-4,"2010-06-01",5.8900000000000001E-4,null,"2016-02-01",9.4999999999999998E-3,"2016-02-01",9.4999999999999998E-3,null,null,null,null,null,null,"2005-06-01",5.4660000000000004E-3,6.2760000000000003E-3,7.0790000000000002E-3,7.8750000000000001E-3,null,"2010-06-01",5.8900000000000001E-4,null,"2010-06-01",2.4659999999999999E-3,3.2729999999999999E-3,4.0740000000000004E-3,4.8669999999999998E-3,null,122,{"$error":"#REF!"},{"$error":"#REF!"},{"$error":"#REF!"},{"$error":"#REF!"},{"$error":"#REF!"},null,null,null,null,null,null,null,null,null,null,null,null,null,null,null,null,null,"2005-06-01",5.0000000000000001E-3,"2005-06-01",5.0000000000000001E-3,null,"2005-06-01",1.5900000000000001E-2,"2005-06-01","2005-06-01",1.5900000000000001E-2,null,"2005-06-01","2005-06-01","","","",1.5900000000000001E-2,1.5900000000000001E-2,1.5402999999999991,null,null,null,null,null,null,null,null,null,null,null,"",null,"2010-06-01",5.8900000000000001E-4,null,"2010-06-01",5.5919449999999316E-3]
[null,"2009-07-01",465,"2009-07-01",465,null,"2010-07-01",-8.9999999999999998E-4,"2010-07-01",-8.9999999999999998E-4,null,"2010-07-01",1E-4,"2010-07-01",1E-4,null,"2010-07-01",1.1509999999999999E-3,"2010-07-01",1.1509999999999999E-3,null,"2016-03-01",4.4000000000000003E-3,"2016-03-01",4.4000000000000003E-3,null,null,null,null,null,null,"2005-07-01",5.0470000000000003E-3,5.8570000000000002E-3,6.659E-3,7.4549999999999998E-3,null,"2010-07-01",1.1509999999999999E-3,null,"2010-07-01",2.4659999999999999E-3,3.2729999999999999E-3,4.0740000000000004E-3,4.8669999999999998E-3,null,123,{"$error":"#REF!"},{"$error":"#REF!"},{"$error":"#REF!"},{"$error":"#REF!"},{"$error":"#REF!"},null,null,null,null,null,null,null,null,null,null,null,null,null,null,null,null,null,"2005-07-01",5.0000000000000001E-3,"2005-07-01",5.0000000000000001E-3,null,"2005-07-01",1.5100000000000001E-2,"2005-07-01","2005-07-01",1.5100000000000001E-2,null,"2005-07-01","2005-07-01","","","",1.5100000000000001E-2,1.5100000000000001E-2,1.5251999999999992,null,null,null,null,null,null,null,null,null,null,null,"",null,"2010-07-01",1.1509999999999999E-3,null,"2010-07-01",6.1567549999999027E-3]
[null,"2009-08-01",465,"2009-08-01",465,null,"2010-08-01",-5.0000000000000001E-4,"2010-08-01",-5.0000000000000001E-4,null,"2010-08-01",4.0000000000000002E-4,"2010-08-01",4.0000000000000002E-4,null,"2010-08-01",9.0899999999999998E-4,"2010-08-01",9.0899999999999998E-4,null,"2016-04-01",6.4000000000000003E-3,"2016-04-01",6.4000000000000003E-3,null,null,null,null,null,null,"2005-08-01",5.94E-3,6.7510000000000001E-3,7.554E-3,8.3499999999999998E-3,null,"2010-08-01",9.0899999999999998E-4,null,"2010-08-01",2.4659999999999999E-3,3.2729999999999999E-3,4.0740000000000004E-3,4.8669999999999998E-3,null,124,{"$error":"#REF!"},{"$error":"#REF!"},{"$error":"#REF!"},{"$error":"#REF!"},{"$error":"#REF!"},null,null,null,null,null,null,null,null,null,null,null,null,null,null,null,null,null,"2005-08-01",5.0000000000000001E-3,"2005-08-01",5.0000000000000001E-3,null,"2005-08-01",1.66E-2,"2005-08-01","2005-08-01",1.66E-2,null,"2005-08-01","2005-08-01","","","",1.66E-2,1.66E-2,1.5085999999999993,null,null,null,null,null,null,null,null,null,null,null,"",null,"2010-08-01",9.0899999999999998E-4,null,"2010-08-01",5.9135449999998535E-3]
[null,"2009-09-01",465,"2009-09-01",465,null,"2010-09-01",3.0999999999999999E-3,"2010-09-01",3.0999999999999999E-3,null,"2010-09-01",4.4999999999999997E-3,"2010-09-01",4.4999999999999997E-3,null,"2010-09-01",7.0200000000000004E-4,"2010-09-01",7.0200000000000004E-4,null,"2016-05-01",9.7999999999999997E-3,"2016-05-01",9.7999999999999997E-3,null,null,null,null,null,null,"2005-09-01",5.1089999999999998E-3,5.9189999999999998E-3,6.7210000000000004E-3,7.5170000000000002E-3,null,"2010-09-01",7.0200000000000004E-4,null,"2010-09-01",2.4659999999999999E-3,3.2729999999999999E-3,4.0740000000000004E-3,4.8669999999999998E-3,null,125,{"$error":"#REF!"},{"$error":"#REF!"},{"$error":"#REF!"},{"$error":"#REF!"},{"$error":"#REF!"},null,null,null,null,null,null,null,null,null,null,null,null,null,null,null,null,null,"2005-09-01",5.0000000000000001E-3,"2005-09-01",5.0000000000000001E-3,null,"2005-09-01",1.4999999999999999E-2,"2005-09-01","2005-09-01",1.4999999999999999E-2,null,"2005-09-01","2005-09-01","","",{"$f":"+IF(OR(COD_JUROS<>3,CD124=\"\"),\"\",1%)","v":""},1.4999999999999999E-2,1.4999999999999999E-2,1.4935999999999994,null,null,null,null,null,null,null,null,null,null,null,"",null,"2010-09-01",7.0200000000000004E-4,null,"2010-09-01",5.7055099999998582E-3]
[null,"2009-10-01",465,"2009-10-01",465,null,"2010-10-01",6.1999999999999998E-3,"2010-10-01",6.1999999999999998E-3,null,"2010-10-01",7.4999999999999997E-3,"2010-10-01",7.4999999999999997E-3,null,"2010-10-01",4.7199999999999998E-4,"2010-10-01",4.7199999999999998E-4,null,"2016-06-01",4.7000000000000002E-3,"2016-06-01",4.7000000000000002E-3,null,null,null,null,null,null,"2005-10-01",4.5710000000000004E-3,5.3800000000000002E-3,6.182E-3,6.9769999999999997E-3,null,"2010-10-01",4.7199999999999998E-4,null,"2010-10-01",2.4659999999999999E-3,3.2729999999999999E-3,4.0740000000000004E-3,4.8669999999999998E-3,null,126,{"$error":"#REF!"},{"$error":"#REF!"},{"$error":"#REF!"},{"$error":"#REF!"},{"$error":"#REF!"},null,null,null,null,null,null,null,null,null,null,null,null,null,null,null,null,null,"2005-10-01",5.0000000000000001E-3,"2005-10-01",5.0000000000000001E-3,null,"2005-10-01",1.41E-2,"2005-10-01","2005-10-01",1.41E-2,null,"2005-10-01","2005-10-01","","","",1.41E-2,1.41E-2,1.4794999999999994,null,null,null,null,null,null,null,null,null,null,null,"",null,"2010-10-01",4.7199999999999998E-4,null,"2010-10-01",5.4743600000000114E-3]
[null,"2009-11-01",465,"2009-11-01",465,null,"2010-11-01",8.6E-3,"2010-11-01",8.6E-3,null,"2010-11-01",8.3000000000000001E-3,"2010-11-01",8.3000000000000001E-3,null,"2010-11-01",3.3599999999999998E-4,"2010-11-01",3.3599999999999998E-4,null,"2016-07-01",6.4000000000000003E-3,"2016-07-01",6.4000000000000003E-3,null,null,null,null,null,null,"2005-11-01",4.4000000000000003E-3,5.2090000000000001E-3,6.0099999999999997E-3,6.8050000000000003E-3,null,"2010-11-01",3.3599999999999998E-4,null,"2010-11-01",2.4659999999999999E-3,3.2729999999999999E-3,4.0740000000000004E-3,4.8669999999999998E-3,null,127,{"$error":"#REF!"},{"$error":"#REF!"},{"$error":"#REF!"},{"$error":"#REF!"},{"$error":"#REF!"},null,null,null,null,null,null,null,null,null,null,null,null,null,null,null,null,null,"2005-11-01",5.0000000000000001E-3,"2005-11-01",5.0000000000000001E-3,null,"2005-11-01",1.38E-2,"2005-11-01","2005-11-01",1.38E-2,null,"2005-11-01","2005-11-01","","","",1.38E-2,1.38E-2,1.4656999999999993,null,null,null,null,null,null,null,null,null,null,null,"",null,"2010-11-01",3.3599999999999998E-4,null,"2010-11-01",5.3376799999997893E-3]
[null,"2009-12-01",465,"2009-12-01",465,null,"2010-12-01",6.8999999999999999E-3,"2010-12-01",6.8999999999999999E-3,null,"2010-12-01",6.3E-3,"2010-12-01",6.3E-3,null,"2010-12-01",1.4059999999999999E-3,"2010-12-01",1.4059999999999999E-3,null,"2016-08-01",3.0999999999999999E-3,"2016-08-01",3.0999999999999999E-3,null,null,null,null,null,null,"2005-12-01",4.7400000000000003E-3,5.5500000000000002E-3,6.352E-3,7.1469999999999997E-3,null,"2010-12-01",1.4059999999999999E-3,null,"2010-12-01",2.4659999999999999E-3,3.2729999999999999E-3,4.0740000000000004E-3,4.8669999999999998E-3,null,128,{"$error":"#REF!"},{"$error":"#REF!"},{"$error":"#REF!"},{"$error":"#REF!"},{"$error":"#REF!"},null,null,null,null,null,null,null,null,null,null,null,null,null,null,null,null,null,"2005-12-01",5.0000000000000001E-3,"2005-12-01",5.0000000000000001E-3,null,"2005-12-01",1.47E-2,"2005-12-01","2005-12-01",1.47E-2,null,"2005-12-01","2005-12-01","","","",1.47E-2,1.47E-2,1.4509999999999994,null,null,null,null,null,null,null,null,null,null,null,"",null,"2010-12-01",1.4059999999999999E-3,null,"2010-12-01",6.4130299999998197E-3]
[null,"2010-01-01",510,"2010-01-01",510,null,"2011-01-01",7.6E-3,"2011-01-01",7.6E-3,null,"2011-01-01",8.3000000000000001E-3,"2011-01-01",8.3000000000000001E-3,null,"2011-01-01",7.1500000000000003E-4,"2011-01-01",7.1500000000000003E-4,null,"2016-09-01",8.0000000000000004E-4,"2016-09-01",8.0000000000000004E-4,null,null,null,null,null,null,"2006-01-01",4.797E-3,5.607E-3,6.4089999999999998E-3,7.2040000000000003E-3,null,"2011-01-01",7.1500000000000003E-4,null,"2011-01-01",2.4659999999999999E-3,3.2729999999999999E-3,4.0740000000000004E-3,4.8669999999999998E-3,null,129,{"$error":"#REF!"},{"$error":"#REF!"},{"$error":"#REF!"},{"$error":"#REF!"},{"$error":"#REF!"},null,null,null,null,null,null,null,null,null,null,null,null,null,null,null,null,null,"2006-01-01",5.0000000000000001E-3,"2006-01-01",5.0000000000000001E-3,null,"2006-01-01",1.43E-2,"2006-01-01","2006-01-01",1.43E-2,null,"2006-01-01","2006-01-01","","","",1.43E-2,1.43E-2,1.4366999999999994,null,null,null,null,null,null,null,null,null,null,null,"",null,"2011-01-01",7.1500000000000003E-4,null,"2011-01-01",5.718574999999948E-3]
[null,"2010-02-01",510,"2010-02-01",510,null,"2011-02-01",9.7000000000000003E-3,"2011-02-01",9.7000000000000003E-3,null,"2011-02-01",8.0000000000000002E-3,"2011-02-01",8.0000000000000002E-3,null,"2011-02-01",5.2400000000000005E-4,"2011-02-01",5.2400000000000005E-4,null,"2016-10-01",1.6999999999999999E-3,"2016-10-01",1.6999999999999999E-3,null,null,null,null,null,null,"2006-02-01",3.1930000000000001E-3,4.0010000000000002E-3,4.8019999999999998E-3,5.5960000000000003E-3,null,"2011-02-01",5.2400000000000005E-4,null,"2011-02-01",2.4659999999999999E-3,3.2729999999999999E-3,4.0740000000000004E-3,4.8669999999999998E-3,null,130,{"$error":"#REF!"},{"$error":"#REF!"},{"$error":"#REF!"},{"$error":"#REF!"},{"$error":"#REF!"},null,null,null,null,null,null,null,null,null,null,null,null,null,null,null,null,null,"2006-02-01",5.0000000000000001E-3,"2006-02-01",5.0000000000000001E-3,null,"2006-02-01",1.15E-2,"2006-02-01","2006-02-01",1.15E-2,null,"2006-02-01","2006-02-01","","","",1.15E-2,1.15E-2,1.4251999999999994,null,null,null,null,null,null,null,null,null,null,null,"",null,"2011-02-01",5.2400000000000005E-4,null,"2011-02-01",5.5266199999999266E-3]
[null,"2010-03-01",510,"2010-03-01",510,null,"2011-03-01",6.0000000000000001E-3,"2011-03-01",6.0000000000000001E-3,null,"2011-03-01",7.9000000000000008E-3,"2011-03-01",7.9000000000000008E-3,null,"2011-03-01",1.212E-3,"2011-03-01",1.212E-3,null,"2016-11-01",6.9999999999999999E-4,"2016-11-01",6.9999999999999999E-4,null,null,null,null,null,null,"2006-03-01",4.5440000000000003E-3,5.3530000000000001E-3,6.1549999999999999E-3,6.9499999999999996E-3,null,"2011-03-01",1.212E-3,null,"2011-03-01",2.4659999999999999E-3,3.2729999999999999E-3,4.0740000000000004E-3,4.8669999999999998E-3,null,131,{"$error":"#REF!"},{"$error":"#REF!"},{"$error":"#REF!"},{"$error":"#REF!"},{"$error":"#REF!"},null,null,null,null,null,null,null,null,null,null,null,null,null,null,null,null,null,"2006-03-01",5.0000000000000001E-3,"2006-03-01",5.0000000000000001E-3,null,"2006-03-01",1.4200000000000001E-2,"2006-03-01","2006-03-01",1.4200000000000001E-2,null,"2006-03-01","2006-03-01","","","",1.4200000000000001E-2,1.4200000000000001E-2,1.4109999999999994,null,null,null,null,null,null,null,null,null,null,null,"",null,"2011-03-01",1.212E-3,null,"2011-03-01",6.2180599999999142E-3]
[null,"2010-04-01",510,"2010-04-01",510,null,"2011-04-01",7.7000000000000002E-3,"2011-04-01",7.7000000000000002E-3,null,"2011-04-01",7.7000000000000002E-3,"2011-04-01",7.7000000000000002E-3,null,"2011-04-01",3.6900000000000002E-4,"2011-04-01",3.6900000000000002E-4,null,"2016-12-01",1.4E-3,"2016-12-01",1.4E-3,null,null,null,null,null,null,"2006-04-01",3.323E-3,4.1310000000000001E-3,4.9319999999999998E-3,5.7260000000000002E-3,null,"2011-04-01",3.6900000000000002E-4,null,"2011-04-01",2.4659999999999999E-3,3.2729999999999999E-3,4.0740000000000004E-3,4.8669999999999998E-3,null,132,{"$error":"#REF!"},{"$error":"#REF!"},{"$error":"#REF!"},{"$error":"#REF!"},{"$error":"#REF!"},null,null,null,null,null,null,null,null,null,null,null,null,null,null,null,null,null,"2006-04-01",5.0000000000000001E-3,"2006-04-01",5.0000000000000001E-3,null,"2006-04-01",1.0800000000000001E-2,"2006-04-01","2006-04-01",1.0800000000000001E-2,null,"2006-04-01","2006-04-01","","","",1.0800000000000001E-2,1.0800000000000001E-2,1.4001999999999994,null,null,null,null,null,null,null,null,null,null,null,"",null,"2011-04-01",3.6900000000000002E-4,null,"2011-04-01",5.3708449999998464E-3]
[null,"2010-05-01",510,"2010-05-01",510,null,"2011-05-01",7.0000000000000001E-3,"2011-05-01",7.0000000000000001E-3,null,"2011-05-01",4.7000000000000002E-3,"2011-05-01",4.7000000000000002E-3,null,"2011-05-01",1.57E-3,"2011-05-01",1.57E-3,null,"2017-01-01",4.1999999999999997E-3,"2017-01-01",4.1999999999999997E-3,null,null,null,null,null,null,"2006-05-01",4.3579999999999999E-3,5.1669999999999997E-3,5.9690000000000003E-3,6.764E-3,null,"2011-05-01",1.57E-3,null,"2011-05-01",2.4659999999999999E-3,3.2729999999999999E-3,4.0740000000000004E-3,4.8669999999999998E-3,null,133,{"$error":"#REF!"},{"$error":"#REF!"},{"$error":"#REF!"},{"$error":"#REF!"},{"$error":"#REF!"},null,null,null,null,null,null,null,null,null,null,null,null,null,null,null,null,null,"2006-05-01",5.0000000000000001E-3,{"$f":"+IF(AND(TRIM(BR133)=\"\",TRIM(BR132)<>\"\"),\"\",IF(TRIM(BR133)=\"\",\"\",TRUNC(BR133,0)))","v":"2006-05-01"},5.0000000000000001E-3,null,"2006-05-01",1.2800000000000001E-2,"2006-05-01","2006-05-01",1.2800000000000001E-2,null,"2006-05-01","2006-05-01","","","",1.2800000000000001E-2,1.2800000000000001E-2,1.3873999999999995,null,null,null,null,null,null,null,null,null,null,null,"",null,"2011-05-01",1.57E-3,null,"2011-05-01",6.5778499999999962E-3]
[null,"2010-06-01",510,"2010-06-01",510,null,"2011-06-01",2.3E-3,"2011-06-01",2.3E-3,null,"2011-06-01",1.5E-3,"2011-06-01",1.5E-3,null,"2011-06-01",1.114E-3,"2011-06-01",1.114E-3,null,"2017-02-01",2.3999999999999998E-3,"2017-02-01",2.3999999999999998E-3,null,null,null,null,null,null,"2006-06-01",4.4079999999999996E-3,5.2170000000000003E-3,6.019E-3,6.8129999999999996E-3,null,"2011-06-01",1.114E-3,null,"2011-06-01",2.4659999999999999E-3,3.2729999999999999E-3,4.0740000000000004E-3,4.8669999999999998E-3,null,134,{"$error":"#REF!"},{"$error":"#REF!"},{"$error":"#REF!"},{"$error":"#REF!"},{"$error":"#REF!"},null,null,null,null,null,null,null,null,null,null,null,null,null,null,null,null,null,"2006-06-01",5.0000000000000001E-3,"2006-06-01",{"$f":"IF(TRIM(BS134)=\"\",\"\",BS134)","v":5.0000000000000001E-3},null,"2006-06-01",1.18E-2,"2006-06-01","2006-06-01",1.18E-2,null,{"$f":"+IF(BT134=\"\",\"\",BT134)","v":"2006-06-01"},"2006-06-01","","","",1.18E-2,1.18E-2,1.3755999999999995,null,null,null,null,null,null,null,null,null,null,null,"",null,"2011-06-01",1.114E-3,null,"2011-06-01",6.1195699999998521E-3]
[null,"2010-07-01",510,"2010-07-01",510,null,"2011-07-01",1E-3,"2011-07-01",1E-3,null,"2011-07-01",1.6000000000000001E-3,"2011-07-01",1.6000000000000001E-3,null,"2011-07-01",1.2290000000000001E-3,"2011-07-01",1.2290000000000001E-3,null,"2017-03-01",3.2000000000000002E-3,"2017-03-01",3.2000000000000002E-3,null,null,null,null,null,null,"2006-07-01",4.2209999999999999E-3,5.0299999999999997E-3,5.8320000000000004E-3,6.6270000000000001E-3,null,"2011-07-01",1.2290000000000001E-3,null,"2011-07-01",2.4659999999999999E-3,3.2729999999999999E-3,4.0740000000000004E-3,4.8669999999999998E-3,null,135,{"$error":"#REF!"},{"$error":"#REF!"},{"$error":"#REF!"},{"$error":"#REF!"},{"$error":"#REF!"},null,null,null,null,null,null,null,null,null,null,null,null,null,null,null,null,null,"2006-07-01",5.0000000000000001E-3,"2006-07-01",5.0000000000000001E-3,null,"2006-07-01",1.17E-2,"2006-07-01","2006-07-01",1.17E-2,null,"2006-07-01","2006-07-01","","","",1.17E-2,1.17E-2,1.3638999999999994,null,null,null,null,null,null,null,null,null,null,null,"",null,"2011-07-01",1.2290000000000001E-3,null,"2011-07-01",6.2351449999997755E-3]
[null,"2010-08-01",510,"2010-08-01",510,null,"2011-08-01",2.7000000000000001E-3,"2011-08-01",2.7000000000000001E-3,null,"2011-08-01",3.7000000000000002E-3,"2011-08-01",3.7000000000000002E-3,null,"2011-08-01",2.0760000000000002E-3,"2011-08-01",2.0760000000000002E-3,null,"2017-04-01",8.0000000000000004E-4,"2017-04-01",8.0000000000000004E-4,null,null,null,null,null,null,"2006-08-01",4.908E-3,5.7169999999999999E-3,6.5199999999999998E-3,7.3150000000000003E-3,null,"2011-08-01",2.0760000000000002E-3,null,"2011-08-01",2.4659999999999999E-3,3.2729999999999999E-3,4.0740000000000004E-3,4.8669999999999998E-3,null,136,{"$error":"#REF!"},{"$error":"#REF!"},{"$error":"#REF!"},{"$error":"#REF!"},{"$error":"#REF!"},null,null,null,null,null,null,null,null,null,null,null,null,null,null,null,null,null,"2006-08-01",5.0000000000000001E-3,"2006-08-01",5.0000000000000001E-3,null,"2006-08-01",1.26E-2,"2006-08-01","2006-08-01",1.26E-2,null,"2006-08-01","2006-08-01","","","",1.26E-2,1.26E-2,1.3512999999999995,null,null,null,null,null,null,null,null,null,null,null,"",null,"2011-08-01",2.0760000000000002E-3,null,"2011-08-01",7.0863799999998367E-3]
[null,"2010-09-01",510,"2010-09-01",510,null,"2011-09-01",5.3E-3,{"$f":"+IF(AND(TRIM(G137)=\"\",TRIM(G136)<>\"\"),EDATE(I136,1),IF(TRIM(G137)=\"\",\"\",TRUNC(G137,0)))","v":"2011-09-01"},{"$f":"+IF(AND(H137=\"\",H136<>\"\"),0,IF(TRIM(H137)=\"\",\"\",H137))","v":5.3E-3},null,"2011-09-01",5.3E-3,{"$f":"+IF(TRIM(L137)=\"\",\"\",TRUNC(L137,0))","v":"2011-09-01"},5.3E-3,null,"2011-09-01",1.003E-3,{"$f":"+IF(AND(TRIM(Q137)=\"\",TRIM(Q136)<>\"\"),EDATE(S136,1),IF(TRIM(Q137)=\"\",\"\",TRUNC(Q137,0)))","v":"2011-09-01"},{"$f":"+IF(AND(R137=\"\",R136<>\"\"),0,IF(TRIM(R137)=\"\",\"\",R137))","v":1.003E-3},null,"2017-05-01",3.5999999999999999E-3,{"$f":"+IF(AND(TRIM(V137)=\"\",TRIM(V136)<>\"\"),EDATE(X136,1),IF(TRIM(V137)=\"\",\"\",TRUNC(V137,0)))","v":"2017-05-01"},{"$f":"+IF(AND(W137=\"\",W136<>\"\"),0,IF(TRIM(W137)=\"\",\"\",W137))","v":3.5999999999999999E-3},null,null,null,null,null,null,"2006-09-01",3.9909999999999998E-3,4.7990000000000003E-3,5.6010000000000001E-3,6.3949999999999996E-3,null,"2011-09-01",1.003E-3,null,"2011-09-01",2.4659999999999999E-3,3.2729999999999999E-3,4.0740000000000004E-3,4.8669999999999998E-3,null,137,{"$f":"IF(INDIRECT(CONCATENATE(VLET_DT,TEXT(AU137,\"#0\")))=\"\",\"\",INDIRECT(CONCATENATE(VLET_DT,TEXT(AU137,\"#0\"))))","v":{"$error":"#REF!"}},{"$f":"+IF(AV137=\"\",\"\",IF(AV137<=VDAT_AT,AV137,\"\"))","v":{"$error":"#REF!"}},{"$f":"IF(OR(AW137=\"\",INDIRECT(CONCATENATE(VLET_COT,TEXT(AU137,\"#0\")))=\"\"),\"\",IF(AW137=VDAT_AT,1+IF(COD_CM=4,0.01,0),INDIRECT(CONCATENATE(VLET_COT,TEXT(AU137,\"#0\")))))","v":{"$error":"#REF!"}},{"$f":"+IF(COD_CM=4,IF(AX137=\"\",\"\",AX137+IF(AY138=\"\",0,AY138)),IF(OR(AV137>VDAT_AT,AV137=\"\"),\"\",IF(AV137=VDAT_AT,1,IF(AY138=\"\",1,AY138)*(1+AX137)/AZ137)))","v":{"$error":"#REF!"}},{"$f":"+IF(AW137=\"\",\"\",LOOKUP(AW137,COL_DAT_CORTE,COL_VAL_CORTE))","v":{"$error":"#REF!"}},null,null,null,null,null,null,null,null,null,null,null,null,null,null,null,null,null,"2006-09-01",5.0000000000000001E-3,"2006-09-01",5.0000000000000001E-3,null,"2006-09-01",1.06E-2,{"$f":"+IF(AND(TRIM(BW137)=\"\",TRIM(BW136)<>\"\"),EDATE(BY136,1),IF(TRIM(BW137)=\"\",\"\",TRUNC(BW137,0)))","v":"2006-09-01"},{"$f":"+IF(BY137=\"\",\"\",IF(BY137<=VDAT_AT,BY137,\"\"))","v":"2006-09-01"},{"$f":"+IF(BY137>VDAT_AT,\"\",IF(AND(BZ137<>\"\",BZ138=\"\"),0.01,IF(TRIM(BX137)=\"\",\"\",BX137)))","v":1.06E-2},null,"2006-09-01","2006-09-01",{"$f":"+IF(CC137=\"\",\"\",IF(COD_JUROS=1,0.5%,IF(COD_JUROS=4,1%,IF(COD_JUROS=11,0%,\"\"))))","v":""},{"$f":"+IF(OR(COD_JUROS<>2,CD137=\"\"),\"\",BU137)","v":""},"",{"$f":"+IF(OR(COD_JUROS<>10,CD137=\"\"),\"\",CA137)","v":1.06E-2},1.06E-2,{"$f":"+IF(CI137=\"\",\"\",IF(CD137=VDAT_AT1,0,CI138+IF(CJ138=\"\",0,CJ138)))","v":1.3406999999999996},null,null,null,null,null,null,null,null,null,null,null,"",null,"2011-09-01",1.003E-3,null,{"$f":"+S137","v":"2011-09-01"},{"$f":"+IF(OR(T137=\"\",BU197=\"\"),\"\",((1+T137)*(1+BU197)-1))","v":6.0080149999999222E-3}]
[null,"2010-10-01",510,{"$f":"+IF(TRIM(B138)=\"\",\"\",B138)","v":"2010-10-01"},510,null,"2011-10-01",4.1999999999999997E-3,"2011-10-01",4.1999999999999997E-3,null,"2011-10-01",4.3E-3,"2011-10-01",{"$f":"+IF(TRIM(M138)=\"\",\"\",M138)","v":4.3E-3},null,"2011-10-01",6.2E-4,"2011-10-01",6.2E-4,null,"2017-06-01",-3.0000000000000001E-3,"2017-06-01",-3.0000000000000001E-3,null,null,null,null,null,null,"2006-10-01",4.3449999999999999E-3,5.1539999999999997E-3,5.9560000000000004E-3,6.7510000000000001E-3,null,"2011-10-01",6.2E-4,null,"2011-10-01",2.4659999999999999E-3,3.2729999999999999E-3,4.0740000000000004E-3,4.8669999999999998E-3,null,138,{"$error":"#REF!"},{"$error":"#REF!"},{"$error":"#REF!"},{"$error":"#REF!"},{"$error":"#REF!"},null,null,null,null,null,null,null,null,null,null,null,null,null,null,null,null,null,"2006-10-01",5.0000000000000001E-3,"2006-10-01",5.0000000000000001E-3,null,"2006-10-01",1.09E-2,"2006-10-01","2006-10-01",1.09E-2,null,"2006-10-01",{"$f":"+IF(CD137=\"\",\"\",IF(EDATE(CD137,1)<=VDAT_AT1,EDATE(CD137,1),\"\"))","v":"2006-10-01"},"","","",1.09E-2,{"$f":"+IF(CD138=\"\",\"\",SUM(CE138:CH138))","v":1.09E-2},1.3297999999999996,null,null,null,null,null,null,null,null,null,null,null,{"$f":"+IF(CU138=\"\",\"\",TRIM(CU138))","v":""},null,"2011-10-01",6.2E-4,null,"2011-10-01",5.623099999999992E-3]
[null,"2010-11-01",510,"2010-11-01",510,null,"2011-11-01",4.5999999999999999E-3,"2011-11-01",4.5999999999999999E-3,null,"2011-11-01",5.1999999999999998E-3,"2011-11-01",5.1999999999999998E-3,null,"2011-11-01",6.4499999999999996E-4,"2011-11-01",6.4499999999999996E-4,null,"2017-07-01",1.6999999999999999E-3,"2017-07-01",1.6999999999999999E-3,null,null,null,null,null,null,"2006-11-01",3.751E-3,4.5589999999999997E-3,5.3610000000000003E-3,6.1549999999999999E-3,null,"2011-11-01",6.4499999999999996E-4,null,"2011-11-01",2.4659999999999999E-3,3.2729999999999999E-3,4.0740000000000004E-3,4.8669999999999998E-3,null,139,{"$error":"#REF!"},{"$error":"#REF!"},{"$error":"#REF!"},{"$error":"#REF!"},{"$error":"#REF!"},null,null,null,null,null,null,null,null,null,null,null,null,null,null,null,null,null,"2006-11-01",5.0000000000000001E-3,"2006-11-01",5.0000000000000001E-3,null,"2006-11-01",1.0200000000000001E-2,"2006-11-01","2006-11-01",1.0200000000000001E-2,null,"2006-11-01","2006-11-01","","","",1.0200000000000001E-2,1.0200000000000001E-2,1.3195999999999997,null,null,null,null,null,null,null,null,null,null,null,"",null,"2011-11-01",6.4499999999999996E-4,null,"2011-11-01",5.6482249999998402E-3]
[null,"2010-12-01",510,"2010-12-01",510,null,"2011-12-01",5.5999999999999999E-3,"2011-12-01",5.5999999999999999E-3,null,"2011-12-01",5.0000000000000001E-3,"2011-12-01",5.0000000000000001E-3,null,"2011-12-01",9.3700000000000001E-4,"2011-12-01",9.3700000000000001E-4,null,"2017-08-01",-2.9999999999999997E-4,"2017-08-01",-2.9999999999999997E-4,null,null,null,null,null,null,"2006-12-01",3.9919999999999999E-3,4.7999999999999996E-3,5.6020000000000002E-3,6.3959999999999998E-3,null,"2011-12-01",9.3700000000000001E-4,null,"2011-12-01",2.4659999999999999E-3,3.2729999999999999E-3,4.0740000000000004E-3,4.8669999999999998E-3,null,140,{"$error":"#REF!"},{"$error":"#REF!"},{"$error":"#REF!"},{"$error":"#REF!"},{"$error":"#REF!"},null,null,null,null,null,null,null,null,null,null,null,null,null,null,null,null,null,"2006-12-01",5.0000000000000001E-3,"2006-12-01",5.0000000000000001E-3,null,"2006-12-01",9.9000000000000008E-3,"2006-12-01","2006-12-01",9.9000000000000008E-3,null,"2006-12-01","2006-12-01","","","",9.9000000000000008E-3,9.9000000000000008E-3,1.3096999999999996,null,null,null,null,null,null,null,null,null,null,null,"",null,"2011-12-01",9.3700000000000001E-4,null,"2011-12-01",5.9416849999998078E-3]
[null,"2011-01-01",540,"2011-01-01",540,null,"2012-01-01",6.4999999999999997E-3,"2012-01-01",6.4999999999999997E-3,null,"2012-01-01",5.5999999999999999E-3,"2012-01-01",5.5999999999999999E-3,null,"2012-01-01",8.6399999999999997E-4,"2012-01-01",8.6399999999999997E-4,null,"2017-09-01",-2.0000000000000001E-4,"2017-09-01",-2.0000000000000001E-4,null,null,null,null,null,null,"2007-01-01",4.6600000000000001E-3,5.4689999999999999E-3,6.2719999999999998E-3,7.0670000000000004E-3,null,"2012-01-01",8.6399999999999997E-4,null,"2012-01-01",2.4659999999999999E-3,3.2729999999999999E-3,4.0740000000000004E-3,4.8669999999999998E-3,null,141,{"$error":"#REF!"},{"$error":"#REF!"},{"$error":"#REF!"},{"$error":"#REF!"},{"$error":"#REF!"},null,null,null,null,null,null,null,null,null,null,null,null,null,null,null,null,null,"2007-01-01",5.0000000000000001E-3,"2007-01-01",5.0000000000000001E-3,null,"2007-01-01",1.0800000000000001E-2,"2007-01-01","2007-01-01",1.0800000000000001E-2,null,"2007-01-01","2007-01-01","","","",1.0800000000000001E-2,1.0800000000000001E-2,1.2988999999999997,null,null,null,null,null,null,null,null,null,null,null,"",null,"2012-01-01",8.6399999999999997E-4,null,"2012-01-01",5.8683199999998159E-3]
[null,"2011-02-01",540,"2011-02-01",540,null,"2012-02-01",5.3E-3,"2012-02-01",5.3E-3,null,"2012-02-01",4.4999999999999997E-3,"2012-02-01",4.4999999999999997E-3,null,"2012-02-01",0,"2012-02-01",0,null,"2017-10-01",3.7000000000000002E-3,"2017-10-01",3.7000000000000002E-3,null,null,null,null,null,null,"2007-02-01",3.189E-3,3.9969999999999997E-3,4.7980000000000002E-3,5.5919999999999997E-3,null,"2012-02-01",0,null,"2012-02-01",2.4659999999999999E-3,3.2729999999999999E-3,4.0740000000000004E-3,4.8669999999999998E-3,null,142,{"$error":"#REF!"},{"$error":"#REF!"},{"$error":"#REF!"},{"$error":"#REF!"},{"$error":"#REF!"},null,null,null,null,null,null,null,null,null,null,null,null,null,null,null,null,null,"2007-02-01",5.0000000000000001E-3,"2007-02-01",5.0000000000000001E-3,null,"2007-02-01",8.6999999999999994E-3,"2007-02-01","2007-02-01",8.6999999999999994E-3,null,"2007-02-01","2007-02-01","","","",8.6999999999999994E-3,8.6999999999999994E-3,1.2901999999999998,null,null,null,null,null,null,null,null,null,null,null,"",null,"2012-02-01",0,null,"2012-02-01",4.9999999999998934E-3]
[null,"2011-03-01",545,"2011-03-01",545,null,"2012-03-01",2.5000000000000001E-3,"2012-03-01",2.5000000000000001E-3,null,"2012-03-01",2.0999999999999999E-3,"2012-03-01",2.0999999999999999E-3,null,"2012-03-01",1.0679999999999999E-3,"2012-03-01",1.0679999999999999E-3,null,"2017-11-01",1.8E-3,"2017-11-01",1.8E-3,null,null,null,null,null,null,"2007-03-01",4.346E-3,5.1549999999999999E-3,5.9569999999999996E-3,6.7520000000000002E-3,null,{"$f":"+S143","v":"2012-03-01"},{"$f":"+T143","v":1.0679999999999999E-3},null,"2012-03-01",2.4659999999999999E-3,3.2729999999999999E-3,4.0740000000000004E-3,4.8669999999999998E-3,null,143,{"$error":"#REF!"},{"$error":"#REF!"},{"$error":"#REF!"},{"$error":"#REF!"},{"$error":"#REF!"},null,null,null,null,null,null,null,null,null,null,null,null,null,null,null,null,null,"2007-03-01",5.0000000000000001E-3,"2007-03-01",5.0000000000000001E-3,null,"2007-03-01",1.0500000000000001E-2,"2007-03-01","2007-03-01",1.0500000000000001E-2,null,"2007-03-01","2007-03-01","","","",1.0500000000000001E-2,1.0500000000000001E-2,1.2796999999999998,null,null,null,null,null,null,null,null,null,null,null,"",null,{"$f":"+S143","v":"2012-03-01"},{"$f":"+T143","v":1.0679999999999999E-3},null,"2012-03-01",6.0733399999999271E-3]
[null,"2011-04-01",545,"2011-04-01",545,null,"2012-04-01",4.3E-3,"2012-04-01",4.3E-3,null,"2012-04-01",6.4000000000000003E-3,"2012-04-01",6.4000000000000003E-3,null,"2012-04-01",2.2699999999999999E-4,"2012-04-01",2.2699999999999999E-4,null,"2017-12-01",2.5999999999999999E-3,"2017-12-01",2.5999999999999999E-3,null,null,null,null,null,null,"2007-04-01",3.741E-3,4.5490000000000001E-3,5.3509999999999999E-3,6.1450000000000003E-3,null,"2012-04-01",2.2699999999999999E-4,null,"2012-04-01",2.4659999999999999E-3,3.2729999999999999E-3,4.0740000000000004E-3,4.8669999999999998E-3,null,144,{"$error":"#REF!"},{"$error":"#REF!"},{"$error":"#REF!"},{"$error":"#REF!"},{"$error":"#REF!"},null,null,null,null,null,null,null,null,null,null,null,null,null,null,null,null,null,"2007-04-01",5.0000000000000001E-3,"2007-04-01",5.0000000000000001E-3,null,"2007-04-01",9.4000000000000004E-3,"2007-04-01","2007-04-01",9.4000000000000004E-3,null,"2007-04-01","2007-04-01","","","",9.4000000000000004E-3,9.4000000000000004E-3,1.2702999999999998,null,null,null,null,null,null,null,null,null,null,null,"",null,"2012-04-01",2.2699999999999999E-4,null,"2012-04-01",5.2281349999998561E-3]
[null,"2011-05-01",545,"2011-05-01",545,null,"2012-05-01",5.1000000000000004E-3,"2012-05-01",5.1000000000000004E-3,null,"2012-05-01",3.5999999999999999E-3,"2012-05-01",3.5999999999999999E-3,null,"2012-05-01",4.6799999999999999E-4,"2012-05-01",4.6799999999999999E-4,null,"2018-01-01",2.3E-3,"2018-01-01",2.3E-3,null,null,null,null,null,null,"2007-05-01",4.1590000000000004E-3,4.9680000000000002E-3,5.77E-3,6.5640000000000004E-3,null,"2012-05-01",4.6799999999999999E-4,null,"2012-05-01",2.4659999999999999E-3,3.2729999999999999E-3,4.0740000000000004E-3,4.8669999999999998E-3,null,145,{"$error":"#REF!"},{"$error":"#REF!"},{"$error":"#REF!"},{"$error":"#REF!"},{"$error":"#REF!"},null,null,null,null,null,null,null,null,null,null,null,null,null,null,null,null,null,"2007-05-01",5.0000000000000001E-3,"2007-05-01",5.0000000000000001E-3,null,"2007-05-01",1.03E-2,"2007-05-01","2007-05-01",1.03E-2,null,"2007-05-01","2007-05-01","","","",1.03E-2,1.03E-2,1.2599999999999998,null,null,null,null,null,null,null,null,null,null,null,"",null,"2012-05-01",4.6799999999999999E-4,null,"2012-05-01",5.4703399999997959E-3]
[null,"2011-06-01",545,"2011-06-01",545,null,"2012-06-01",1.8E-3,"2012-06-01",1.8E-3,null,"2012-06-01",8.0000000000000004E-4,"2012-06-01",8.0000000000000004E-4,null,"2012-06-01",0,"2012-06-01",0,null,"2018-02-01",1.8E-3,"2018-02-01",1.8E-3,null,null,null,null,null,null,"2007-06-01",3.4220000000000001E-3,4.2300000000000003E-3,5.032E-3,5.8259999999999996E-3,null,"2012-06-01",0,null,"2012-06-01",2.4659999999999999E-3,3.2729999999999999E-3,4.0740000000000004E-3,4.8669999999999998E-3,null,146,{"$error":"#REF!"},{"$error":"#REF!"},{"$error":"#REF!"},{"$error":"#REF!"},{"$error":"#REF!"},null,null,null,null,null,null,null,null,null,null,null,null,null,null,null,null,null,"2007-06-01",5.0000000000000001E-3,"2007-06-01",5.0000000000000001E-3,null,"2007-06-01",9.1000000000000004E-3,"2007-06-01","2007-06-01",9.1000000000000004E-3,null,"2007-06-01","2007-06-01","","","",9.1000000000000004E-3,9.1000000000000004E-3,1.2508999999999997,null,null,null,null,null,null,null,null,null,null,null,"",null,"2012-06-01",0,null,"2012-06-01",4.9999999999998934E-3]
[null,"2011-07-01",545,"2011-07-01",545,null,"2012-07-01",3.3E-3,"2012-07-01",3.3E-3,null,"2012-07-01",4.3E-3,"2012-07-01",4.3E-3,null,"2012-07-01",1.44E-4,"2012-07-01",1.44E-4,null,"2018-03-01",6.9999999999999999E-4,"2018-03-01",6.9999999999999999E-4,null,null,null,null,null,null,"2007-07-01",3.9379999999999997E-3,4.7470000000000004E-3,5.5490000000000001E-3,6.3429999999999997E-3,null,"2012-07-01",1.44E-4,null,"2012-07-01",2.4659999999999999E-3,3.2729999999999999E-3,4.0740000000000004E-3,4.8669999999999998E-3,null,147,{"$error":"#REF!"},{"$error":"#REF!"},{"$error":"#REF!"},{"$error":"#REF!"},{"$error":"#REF!"},null,null,null,null,null,null,null,null,null,null,null,null,null,null,null,null,null,"2007-07-01",5.0000000000000001E-3,"2007-07-01",5.0000000000000001E-3,null,"2007-07-01",9.7000000000000003E-3,"2007-07-01","2007-07-01",9.7000000000000003E-3,null,"2007-07-01","2007-07-01","","","",9.7000000000000003E-3,9.7000000000000003E-3,1.2411999999999996,null,null,null,null,null,null,null,null,null,null,null,"",null,"2012-07-01",1.44E-4,null,"2012-07-01",4.9726952319999462E-3]
[null,"2011-08-01",545,"2011-08-01",545,null,"2012-08-01",3.8999999999999998E-3,"2012-08-01",3.8999999999999998E-3,null,"2012-08-01",4.1000000000000003E-3,"2012-08-01",4.1000000000000003E-3,null,"2012-08-01",1.2300000000000001E-4,"2012-08-01",1.2300000000000001E-4,null,"2018-04-01",2.0999999999999999E-3,"2018-04-01",2.0999999999999999E-3,null,null,null,null,null,null,"2007-08-01",3.9350000000000001E-3,4.744E-3,5.5459999999999997E-3,6.3400000000000001E-3,null,"2012-08-01",1.2300000000000001E-4,null,"2012-08-01",2.4659999999999999E-3,3.2729999999999999E-3,4.0740000000000004E-3,4.8669999999999998E-3,null,148,{"$error":"#REF!"},{"$error":"#REF!"},{"$error":"#REF!"},{"$error":"#REF!"},{"$error":"#REF!"},null,null,null,null,null,null,null,null,null,null,null,null,null,null,null,null,null,"2007-08-01",5.0000000000000001E-3,"2007-08-01",5.0000000000000001E-3,null,"2007-08-01",9.9000000000000008E-3,"2007-08-01","2007-08-01",9.9000000000000008E-3,null,"2007-08-01","2007-08-01","","","",9.9000000000000008E-3,9.9000000000000008E-3,1.2312999999999996,null,null,null,null,null,null,null,null,null,null,null,"",null,"2012-08-01",1.2300000000000001E-4,null,"2012-08-01",4.9515938440001239E-3]
[null,"2011-09-01",545,"2011-09-01",545,null,"2012-09-01",4.7999999999999996E-3,"2012-09-01",4.7999999999999996E-3,null,"2012-09-01",5.7000000000000002E-3,"2012-09-01",5.7000000000000002E-3,null,"2012-09-01",0,"2012-09-01",0,null,"2018-05-01",4.3E-3,"2018-05-01",4.3E-3,null,null,null,null,null,null,"2007-09-01",2.8189999999999999E-3,3.6259999999999999E-3,4.4270000000000004E-3,5.2209999999999999E-3,null,"2012-09-01",0,null,"2012-09-01",2.4659999999999999E-3,3.2729999999999999E-3,4.0740000000000004E-3,4.8669999999999998E-3,null,149,{"$error":"#REF!"},{"$error":"#REF!"},{"$error":"#REF!"},{"$error":"#REF!"},{"$error":"#REF!"},null,null,null,null,null,null,null,null,null,null,null,null,null,null,null,null,null,"2007-09-01",5.0000000000000001E-3,"2007-09-01",5.0000000000000001E-3,null,"2007-09-01",8.0000000000000002E-3,"2007-09-01","2007-09-01",8.0000000000000002E-3,null,"2007-09-01","2007-09-01","","","",8.0000000000000002E-3,8.0000000000000002E-3,1.2232999999999996,null,null,null,null,null,null,null,null,null,null,null,"",null,"2012-09-01",0,null,"2012-09-01",4.5509999999999717E-3]
[null,"2011-10-01",545,"2011-10-01",545,null,"2012-10-01",6.4999999999999997E-3,"2012-10-01",6.4999999999999997E-3,null,"2012-10-01",5.8999999999999999E-3,"2012-10-01",5.8999999999999999E-3,null,"2012-10-01",0,"2012-10-01",0,null,"2018-06-01",1.43E-2,"2018-06-01",1.43E-2,null,null,null,null,null,null,"2007-10-01",3.6110000000000001E-3,4.4190000000000002E-3,5.2199999999999998E-3,6.0150000000000004E-3,null,"2012-10-01",0,null,"2012-10-01",2.4659999999999999E-3,3.2729999999999999E-3,4.0740000000000004E-3,4.8669999999999998E-3,null,150,{"$error":"#REF!"},{"$error":"#REF!"},{"$error":"#REF!"},{"$error":"#REF!"},{"$error":"#REF!"},null,null,null,null,null,null,null,null,null,null,null,null,null,null,null,null,null,"2007-10-01",5.0000000000000001E-3,"2007-10-01",5.0000000000000001E-3,null,"2007-10-01",9.2999999999999992E-3,"2007-10-01","2007-10-01",9.2999999999999992E-3,null,"2007-10-01","2007-10-01","","","",9.2999999999999992E-3,9.2999999999999992E-3,1.2139999999999995,null,null,null,null,null,null,null,null,null,null,null,"",null,"2012-10-01",0,null,"2012-10-01",4.2729999999999713E-3]
[null,"2011-11-01",545,"2011-11-01",545,null,"2012-11-01",5.4000000000000003E-3,"2012-11-01",5.4000000000000003E-3,null,"2012-11-01",6.0000000000000001E-3,"2012-11-01",6.0000000000000001E-3,null,"2012-11-01",0,"2012-11-01",0,null,"2018-07-01",2.5000000000000001E-3,"2018-07-01",2.5000000000000001E-3,null,null,null,null,null,null,"2007-11-01",3.0569999999999998E-3,3.8649999999999999E-3,4.666E-3,5.4599999999999996E-3,null,"2012-11-01",0,null,"2012-11-01",2.4659999999999999E-3,3.2729999999999999E-3,4.0740000000000004E-3,4.8669999999999998E-3,null,151,{"$error":"#REF!"},{"$error":"#REF!"},{"$error":"#REF!"},{"$error":"#REF!"},{"$error":"#REF!"},null,null,null,null,null,null,null,null,null,null,null,null,null,null,null,null,null,"2007-11-01",5.0000000000000001E-3,"2007-11-01",5.0000000000000001E-3,null,"2007-11-01",8.3999999999999995E-3,"2007-11-01","2007-11-01",8.3999999999999995E-3,null,"2007-11-01","2007-11-01","","","",8.3999999999999995E-3,8.3999999999999995E-3,1.2055999999999996,null,null,null,null,null,null,null,null,null,null,null,"",null,"2012-11-01",0,null,"2012-11-01",4.2729999999999713E-3]
[null,"2011-12-01",545,"2011-12-01",545,null,"2012-12-01",6.8999999999999999E-3,"2012-12-01",6.8999999999999999E-3,null,"2012-12-01",7.9000000000000008E-3,"2012-12-01",7.9000000000000008E-3,null,"2012-12-01",0,"2012-12-01",0,null,"2018-08-01",0,"2018-08-01",0,null,null,null,null,null,null,"2007-12-01",3.107E-3,3.9150000000000001E-3,4.7159999999999997E-3,5.5100000000000001E-3,null,"2012-12-01",0,null,"2012-12-01",2.4659999999999999E-3,3.2729999999999999E-3,4.0740000000000004E-3,4.8669999999999998E-3,null,152,{"$error":"#REF!"},{"$error":"#REF!"},{"$error":"#REF!"},{"$error":"#REF!"},{"$error":"#REF!"},null,null,null,null,null,null,null,null,null,null,null,null,null,null,null,null,null,"2007-12-01",5.0000000000000001E-3,"2007-12-01",5.0000000000000001E-3,null,"2007-12-01",8.3999999999999995E-3,"2007-12-01","2007-12-01",8.3999999999999995E-3,null,"2007-12-01","2007-12-01","","","",8.3999999999999995E-3,8.3999999999999995E-3,1.1971999999999996,null,null,null,null,null,null,null,null,null,null,null,"",null,"2012-12-01",0,null,"2012-12-01",4.1340000000000821E-3]
[null,"2012-01-01",622,"2012-01-01",622,null,"2013-01-01",8.8000000000000005E-3,"2013-01-01",8.8000000000000005E-3,null,"2013-01-01",8.6E-3,"2013-01-01",8.6E-3,null,"2013-01-01",0,"2013-01-01",0,null,"2018-09-01",3.0000000000000001E-3,"2018-09-01",3.0000000000000001E-3,null,null,null,null,null,null,"2008-01-01",3.4780000000000002E-3,4.287E-3,5.0879999999999996E-3,5.8820000000000001E-3,null,"2013-01-01",0,null,"2013-01-01",2.4659999999999999E-3,3.2729999999999999E-3,4.0740000000000004E-3,4.8669999999999998E-3,null,153,{"$error":"#REF!"},{"$error":"#REF!"},{"$error":"#REF!"},{"$error":"#REF!"},{"$error":"#REF!"},null,null,null,null,null,null,null,null,null,null,null,null,null,null,null,null,null,"2008-01-01",5.0000000000000001E-3,"2008-01-01",5.0000000000000001E-3,null,"2008-01-01",9.2999999999999992E-3,"2008-01-01","2008-01-01",9.2999999999999992E-3,null,"2008-01-01","2008-01-01","","","",9.2999999999999992E-3,9.2999999999999992E-3,1.1878999999999995,null,null,null,null,null,null,null,null,null,null,null,"",null,"2013-01-01",0,null,"2013-01-01",4.1340000000000821E-3]
[null,"2012-02-01",622,"2012-02-01",622,null,"2013-02-01",6.7999999999999996E-3,"2013-02-01",6.7999999999999996E-3,null,"2013-02-01",6.0000000000000001E-3,"2013-02-01",6.0000000000000001E-3,null,"2013-02-01",0,"2013-02-01",0,null,"2018-10-01",4.0000000000000001E-3,"2018-10-01",4.0000000000000001E-3,null,null,null,null,null,null,"2008-02-01",2.709E-3,3.5170000000000002E-3,4.3179999999999998E-3,5.1110000000000001E-3,null,"2013-02-01",0,null,"2013-02-01",2.4659999999999999E-3,3.2729999999999999E-3,4.0740000000000004E-3,4.8669999999999998E-3,null,154,{"$error":"#REF!"},{"$error":"#REF!"},{"$error":"#REF!"},{"$error":"#REF!"},{"$error":"#REF!"},null,null,null,null,null,null,null,null,null,null,null,null,null,null,null,null,null,"2008-02-01",5.0000000000000001E-3,"2008-02-01",5.0000000000000001E-3,null,"2008-02-01",8.0000000000000002E-3,"2008-02-01","2008-02-01",8.0000000000000002E-3,null,"2008-02-01","2008-02-01","","","",8.0000000000000002E-3,8.0000000000000002E-3,1.1798999999999995,null,null,null,null,null,null,null,null,null,null,null,"",null,"2013-02-01",0,null,"2013-02-01",4.1340000000000821E-3]
[null,"2012-03-01",622,"2012-03-01",622,null,"2013-03-01",4.8999999999999998E-3,"2013-03-01",4.8999999999999998E-3,null,"2013-03-01",4.7000000000000002E-3,"2013-03-01",4.7000000000000002E-3,null,"2013-03-01",0,"2013-03-01",0,null,"2018-11-01",-2.5000000000000001E-3,"2018-11-01",-2.5000000000000001E-3,null,null,null,null,null,null,"2008-03-01",2.8760000000000001E-3,3.6840000000000002E-3,4.4840000000000001E-3,5.2779999999999997E-3,null,"2013-03-01",0,null,"2013-03-01",2.4659999999999999E-3,3.2729999999999999E-3,4.0740000000000004E-3,4.8669999999999998E-3,null,155,{"$error":"#REF!"},{"$error":"#REF!"},{"$error":"#REF!"},{"$error":"#REF!"},{"$error":"#REF!"},null,null,null,null,null,null,null,null,null,null,null,null,null,null,null,null,null,"2008-03-01",5.0000000000000001E-3,"2008-03-01",5.0000000000000001E-3,null,"2008-03-01",8.3999999999999995E-3,"2008-03-01","2008-03-01",8.3999999999999995E-3,null,"2008-03-01","2008-03-01","","","",8.3999999999999995E-3,8.3999999999999995E-3,1.1714999999999995,null,null,null,null,null,null,null,null,null,null,null,"",null,"2013-03-01",0,null,"2013-03-01",4.1340000000000821E-3]
[null,"2012-04-01",622,"2012-04-01",622,null,"2013-04-01",5.1000000000000004E-3,"2013-04-01",5.1000000000000004E-3,null,"2013-04-01",5.4999999999999997E-3,"2013-04-01",5.4999999999999997E-3,null,"2013-04-01",0,"2013-04-01",0,null,"2018-12-01",1.4E-3,"2018-12-01",1.4E-3,null,null,null,null,null,null,"2008-04-01",3.4229999999999998E-3,4.2310000000000004E-3,5.0330000000000001E-3,5.8269999999999997E-3,null,"2013-04-01",0,null,"2013-04-01",2.4659999999999999E-3,3.2729999999999999E-3,4.0740000000000004E-3,4.8669999999999998E-3,null,156,{"$error":"#REF!"},{"$error":"#REF!"},{"$error":"#REF!"},{"$error":"#REF!"},{"$error":"#REF!"},null,null,null,null,null,null,null,null,null,null,null,null,null,null,null,null,null,"2008-04-01",5.0000000000000001E-3,"2008-04-01",5.0000000000000001E-3,null,"2008-04-01",8.9999999999999993E-3,"2008-04-01","2008-04-01",8.9999999999999993E-3,null,"2008-04-01","2008-04-01","","","",8.9999999999999993E-3,8.9999999999999993E-3,1.1624999999999996,null,null,null,null,null,null,null,null,null,null,null,"",null,"2013-04-01",0,null,"2013-04-01",4.1340000000000821E-3]
[null,"2012-05-01",622,"2012-05-01",622,null,"2013-05-01",4.5999999999999999E-3,"2013-05-01",4.5999999999999999E-3,null,"2013-05-01",3.7000000000000002E-3,"2013-05-01",3.7000000000000002E-3,null,"2013-05-01",0,"2013-05-01",0,null,"2019-01-01",3.5999999999999999E-3,"2019-01-01",3.5999999999999999E-3,null,null,null,null,null,null,"2008-05-01",3.2039999999999998E-3,4.0119999999999999E-3,4.8129999999999996E-3,5.607E-3,null,"2013-05-01",0,null,"2013-05-01",2.4659999999999999E-3,3.2729999999999999E-3,4.0740000000000004E-3,4.8669999999999998E-3,null,157,{"$error":"#REF!"},{"$error":"#REF!"},{"$error":"#REF!"},{"$error":"#REF!"},{"$error":"#REF!"},null,null,null,null,null,null,null,null,null,null,null,null,null,null,null,null,null,"2008-05-01",5.0000000000000001E-3,"2008-05-01",5.0000000000000001E-3,null,"2008-05-01",8.8000000000000005E-3,"2008-05-01","2008-05-01",8.8000000000000005E-3,null,"2008-05-01","2008-05-01","","",{"$f":"+IF(OR(COD_JUROS<>3,CD156=\"\"),\"\",1%)","v":""},8.8000000000000005E-3,8.8000000000000005E-3,1.1536999999999997,null,null,null,null,null,null,null,null,null,null,null,"",null,"2013-05-01",0,null,"2013-05-01",4.1340000000000821E-3]
[null,"2012-06-01",622,"2012-06-01",622,null,"2013-06-01",3.8E-3,"2013-06-01",3.8E-3,null,"2013-06-01",2.5999999999999999E-3,"2013-06-01",2.5999999999999999E-3,null,"2013-06-01",0,"2013-06-01",0,null,"2019-02-01",5.4000000000000003E-3,"2019-02-01",5.4000000000000003E-3,null,null,null,null,null,null,"2008-06-01",3.6150000000000002E-3,4.4229999999999998E-3,5.2240000000000003E-3,6.019E-3,null,"2013-06-01",0,null,"2013-06-01",2.4659999999999999E-3,3.2729999999999999E-3,4.0740000000000004E-3,4.8669999999999998E-3,null,158,{"$error":"#REF!"},{"$error":"#REF!"},{"$error":"#REF!"},{"$error":"#REF!"},{"$error":"#REF!"},null,null,null,null,null,null,null,null,null,null,null,null,null,null,null,null,null,"2008-06-01",5.0000000000000001E-3,"2008-06-01",5.0000000000000001E-3,null,"2008-06-01",9.5999999999999992E-3,"2008-06-01","2008-06-01",9.5999999999999992E-3,null,"2008-06-01","2008-06-01","","","",9.5999999999999992E-3,9.5999999999999992E-3,1.1440999999999997,null,null,null,null,null,null,null,null,null,null,null,"",null,"2013-06-01",0,null,"2013-06-01",4.2729999999999713E-3]
[null,"2012-07-01",622,"2012-07-01",622,null,"2013-07-01",6.9999999999999999E-4,"2013-07-01",6.9999999999999999E-4,null,"2013-07-01",2.9999999999999997E-4,"2013-07-01",2.9999999999999997E-4,null,"2013-07-01",2.0900000000000001E-4,"2013-07-01",2.0900000000000001E-4,null,"2019-03-01",7.7000000000000002E-3,"2019-03-01",7.7000000000000002E-3,null,null,null,null,null,null,"2008-07-01",4.3839999999999999E-3,5.1929999999999997E-3,5.9950000000000003E-3,6.79E-3,null,"2013-07-01",2.0900000000000001E-4,null,"2013-07-01",2.4659999999999999E-3,3.2729999999999999E-3,4.0740000000000004E-3,4.8669999999999998E-3,null,159,{"$error":"#REF!"},{"$error":"#REF!"},{"$error":"#REF!"},{"$error":"#REF!"},{"$error":"#REF!"},null,null,null,null,null,null,null,null,null,null,null,null,null,null,null,null,null,"2008-07-01",5.0000000000000001E-3,"2008-07-01",5.0000000000000001E-3,null,"2008-07-01",1.0699999999999999E-2,"2008-07-01","2008-07-01",1.0699999999999999E-2,null,"2008-07-01","2008-07-01","","","",1.0699999999999999E-2,1.0699999999999999E-2,1.1333999999999997,null,null,null,null,null,null,null,null,null,null,null,"",null,"2013-07-01",2.0900000000000001E-4,null,"2013-07-01",4.7609511589998821E-3]
[null,"2012-08-01",622,"2012-08-01",622,null,"2013-08-01",1.6000000000000001E-3,"2013-08-01",1.6000000000000001E-3,null,"2013-08-01",2.3999999999999998E-3,"2013-08-01",2.3999999999999998E-3,null,"2013-08-01",0,"2013-08-01",0,null,"2019-04-01",6.0000000000000001E-3,"2019-04-01",6.0000000000000001E-3,null,null,null,null,null,null,"2008-08-01",4.0439999999999999E-3,4.8520000000000004E-3,5.6540000000000002E-3,6.4489999999999999E-3,null,"2013-08-01",0,null,"2013-08-01",2.4659999999999999E-3,3.2729999999999999E-3,4.0740000000000004E-3,4.8669999999999998E-3,null,160,{"$error":"#REF!"},{"$error":"#REF!"},{"$error":"#REF!"},{"$error":"#REF!"},{"$error":"#REF!"},null,null,null,null,null,null,null,null,null,null,null,null,null,null,null,null,null,"2008-08-01",5.0000000000000001E-3,"2008-08-01",5.0000000000000001E-3,null,"2008-08-01",1.0200000000000001E-2,"2008-08-01","2008-08-01",1.0200000000000001E-2,null,"2008-08-01","2008-08-01","","","",1.0200000000000001E-2,1.0200000000000001E-2,1.1231999999999998,null,null,null,null,null,null,null,null,null,null,null,"",null,"2013-08-01",0,null,"2013-08-01",4.5509999999999717E-3]
[null,"2012-09-01",622,"2012-09-01",622,null,"2013-09-01",2.7000000000000001E-3,"2013-09-01",2.7000000000000001E-3,null,"2013-09-01",3.5000000000000001E-3,"2013-09-01",3.5000000000000001E-3,null,"2013-09-01",7.8999999999999996E-5,"2013-09-01",7.8999999999999996E-5,null,"2019-05-01",1.5E-3,"2019-05-01",1.5E-3,null,null,null,null,null,null,"2008-09-01",4.4409999999999996E-3,5.2500000000000003E-3,6.0520000000000001E-3,6.8469999999999998E-3,null,"2013-09-01",7.8999999999999996E-5,null,"2013-09-01",2.4659999999999999E-3,3.2729999999999999E-3,4.0740000000000004E-3,4.8669999999999998E-3,null,161,{"$error":"#REF!"},{"$error":"#REF!"},{"$error":"#REF!"},{"$error":"#REF!"},{"$error":"#REF!"},null,null,null,null,null,null,null,null,null,null,null,null,null,null,null,null,null,"2008-09-01",5.0000000000000001E-3,"2008-09-01",5.0000000000000001E-3,null,"2008-09-01",1.0999999999999999E-2,"2008-09-01","2008-09-01",1.0999999999999999E-2,null,"2008-09-01","2008-09-01","","","",1.0999999999999999E-2,1.0999999999999999E-2,1.1121999999999999,null,null,null,null,null,null,null,null,null,null,null,"",null,"2013-09-01",7.8999999999999996E-5,null,"2013-09-01",4.9073814119999781E-3]
[null,"2012-10-01",622,"2012-10-01",622,null,"2013-10-01",4.7999999999999996E-3,"2013-10-01",4.7999999999999996E-3,null,"2013-10-01",5.7000000000000002E-3,"2013-10-01",5.7000000000000002E-3,null,"2013-10-01",9.2000000000000003E-4,"2013-10-01",9.2000000000000003E-4,null,"2019-06-01",1E-4,"2019-06-01",1E-4,null,null,null,null,null,null,"2008-10-01",4.9779999999999998E-3,5.7869999999999996E-3,6.5900000000000004E-3,7.3850000000000001E-3,null,"2013-10-01",9.2000000000000003E-4,null,"2013-10-01",2.4659999999999999E-3,3.2729999999999999E-3,4.0740000000000004E-3,4.8669999999999998E-3,null,162,{"$error":"#REF!"},{"$error":"#REF!"},{"$error":"#REF!"},{"$error":"#REF!"},{"$error":"#REF!"},null,null,null,null,null,null,null,null,null,null,null,null,null,null,null,null,null,"2008-10-01",5.0000000000000001E-3,"2008-10-01",5.0000000000000001E-3,null,"2008-10-01",1.18E-2,"2008-10-01","2008-10-01",1.18E-2,null,"2008-10-01","2008-10-01","","","",1.18E-2,1.18E-2,1.1003999999999998,null,null,null,null,null,null,null,null,null,null,null,"",null,"2013-10-01",9.2000000000000003E-4,null,"2013-10-01",5.9245999999999466E-3]
[null,"2012-11-01",622,"2012-11-01",622,null,"2013-11-01",5.7000000000000002E-3,"2013-11-01",5.7000000000000002E-3,null,"2013-11-01",5.4000000000000003E-3,"2013-11-01",5.4000000000000003E-3,null,"2013-11-01",2.0699999999999999E-4,"2013-11-01",2.0699999999999999E-4,null,"2019-07-01",1E-3,"2019-07-01",1E-3,null,null,null,null,null,null,"2008-11-01",4.0879999999999996E-3,4.8970000000000003E-3,5.6979999999999999E-3,6.4929999999999996E-3,null,"2013-11-01",2.0699999999999999E-4,null,"2013-11-01",2.4659999999999999E-3,3.2729999999999999E-3,4.0740000000000004E-3,4.8669999999999998E-3,null,163,{"$error":"#REF!"},{"$error":"#REF!"},{"$error":"#REF!"},{"$error":"#REF!"},{"$error":"#REF!"},null,null,null,null,null,null,null,null,null,null,null,null,null,null,null,null,null,"2008-11-01",5.0000000000000001E-3,"2008-11-01",5.0000000000000001E-3,null,"2008-11-01",1.0200000000000001E-2,"2008-11-01","2008-11-01",1.0200000000000001E-2,null,"2008-11-01","2008-11-01","","","",1.0200000000000001E-2,1.0200000000000001E-2,1.0901999999999998,null,null,null,null,null,null,null,null,null,null,null,"",null,"2013-11-01",2.0699999999999999E-4,null,"2013-11-01",5.2080349999998887E-3]
[null,"2012-12-01",622,"2012-12-01",622,null,"2013-12-01",7.4999999999999997E-3,"2013-12-01",7.4999999999999997E-3,null,"2013-12-01",9.1999999999999998E-3,"2013-12-01",9.1999999999999998E-3,null,"2013-12-01",4.9399999999999997E-4,"2013-12-01",4.9399999999999997E-4,null,"2019-08-01",1.1999999999999999E-3,"2019-08-01",1.1999999999999999E-3,null,null,null,null,null,null,"2008-12-01",4.62E-3,5.4289999999999998E-3,6.2310000000000004E-3,7.0270000000000003E-3,null,"2013-12-01",4.9399999999999997E-4,null,"2013-12-01",2.4659999999999999E-3,3.2729999999999999E-3,4.0740000000000004E-3,4.8669999999999998E-3,null,164,{"$error":"#REF!"},{"$error":"#REF!"},{"$error":"#REF!"},{"$error":"#REF!"},{"$error":"#REF!"},null,null,null,null,null,null,null,null,null,null,null,null,null,null,null,null,null,"2008-12-01",5.0000000000000001E-3,"2008-12-01",5.0000000000000001E-3,null,"2008-12-01",1.12E-2,"2008-12-01","2008-12-01",1.12E-2,null,"2008-12-01","2008-12-01","","","",1.12E-2,1.12E-2,1.0789999999999997,null,null,null,null,null,null,null,null,null,null,null,"",null,"2013-12-01",4.9399999999999997E-4,null,"2013-12-01",5.4964699999999755E-3]
[null,"2013-01-01",678,"2013-01-01",678,null,"2014-01-01",6.7000000000000002E-3,"2014-01-01",6.7000000000000002E-3,null,"2014-01-01",5.4999999999999997E-3,"2014-01-01",5.4999999999999997E-3,null,"2014-01-01",1.126E-3,"2014-01-01",1.126E-3,null,"2019-09-01",-5.0000000000000001E-4,"2019-09-01",-5.0000000000000001E-4,null,null,null,null,null,null,"2009-01-01",4.3099999999999996E-3,5.1190000000000003E-3,5.921E-3,6.7159999999999997E-3,null,"2014-01-01",1.126E-3,null,"2014-01-01",2.4659999999999999E-3,3.2729999999999999E-3,4.0740000000000004E-3,4.8669999999999998E-3,null,165,{"$error":"#REF!"},{"$error":"#REF!"},{"$error":"#REF!"},{"$error":"#REF!"},{"$error":"#REF!"},null,null,null,null,null,null,null,null,null,null,null,null,null,null,null,null,null,"2009-01-01",5.0000000000000001E-3,"2009-01-01",5.0000000000000001E-3,null,"2009-01-01",1.0500000000000001E-2,"2009-01-01","2009-01-01",1.0500000000000001E-2,null,"2009-01-01","2009-01-01","","","",1.0500000000000001E-2,1.0500000000000001E-2,1.0684999999999998,null,null,null,null,null,null,null,null,null,null,null,"",null,"2014-01-01",1.126E-3,null,"2014-01-01",6.1316299999998325E-3]
[null,"2013-02-01",678,"2013-02-01",678,null,"2014-02-01",7.0000000000000001E-3,"2014-02-01",7.0000000000000001E-3,null,"2014-02-01",6.8999999999999999E-3,"2014-02-01",6.8999999999999999E-3,null,"2014-02-01",5.3700000000000004E-4,"2014-02-01",5.3700000000000004E-4,null,"2019-10-01",4.0000000000000002E-4,"2019-10-01",4.0000000000000002E-4,null,null,null,null,null,null,"2009-02-01",2.918E-3,3.7260000000000001E-3,4.5259999999999996E-3,5.3200000000000001E-3,null,"2014-02-01",5.3700000000000004E-4,null,"2014-02-01",2.4659999999999999E-3,3.2729999999999999E-3,4.0740000000000004E-3,4.8669999999999998E-3,null,166,{"$error":"#REF!"},{"$error":"#REF!"},{"$error":"#REF!"},{"$error":"#REF!"},{"$error":"#REF!"},null,null,null,null,null,null,null,null,null,null,null,null,null,null,null,null,null,"2009-02-01",5.0000000000000001E-3,"2009-02-01",5.0000000000000001E-3,null,"2009-02-01",8.6E-3,"2009-02-01","2009-02-01",8.6E-3,null,"2009-02-01","2009-02-01","","","",8.6E-3,8.6E-3,1.0598999999999998,null,null,null,null,null,null,null,null,null,null,null,"",null,"2014-02-01",5.3700000000000004E-4,null,"2014-02-01",5.5396849999997944E-3]
[null,"2013-03-01",678,"2013-03-01",678,null,"2014-03-01",7.3000000000000001E-3,"2014-03-01",7.3000000000000001E-3,null,"2014-03-01",9.1999999999999998E-3,"2014-03-01",9.1999999999999998E-3,null,"2014-03-01",2.6600000000000001E-4,"2014-03-01",2.6600000000000001E-4,null,"2019-11-01",5.4000000000000003E-3,"2019-11-01",5.4000000000000003E-3,null,null,null,null,null,null,"2009-03-01",3.9069999999999999E-3,4.7159999999999997E-3,5.5170000000000002E-3,6.3119999999999999E-3,null,"2014-03-01",2.6600000000000001E-4,null,"2014-03-01",2.4659999999999999E-3,3.2729999999999999E-3,4.0740000000000004E-3,4.8669999999999998E-3,null,167,{"$error":"#REF!"},{"$error":"#REF!"},{"$error":"#REF!"},{"$error":"#REF!"},{"$error":"#REF!"},null,null,null,null,null,null,null,null,null,null,null,null,null,null,null,null,null,"2009-03-01",5.0000000000000001E-3,"2009-03-01",5.0000000000000001E-3,null,"2009-03-01",9.7000000000000003E-3,"2009-03-01","2009-03-01",9.7000000000000003E-3,null,"2009-03-01","2009-03-01","","","",9.7000000000000003E-3,9.7000000000000003E-3,1.0501999999999998,null,null,null,null,null,null,null,null,null,null,null,"",null,"2014-03-01",2.6600000000000001E-4,null,"2014-03-01",5.2673299999999035E-3]
[null,"2013-04-01",678,"2013-04-01",678,null,"2014-04-01",7.7999999999999996E-3,"2014-04-01",7.7999999999999996E-3,null,"2014-04-01",6.7000000000000002E-3,"2014-04-01",6.7000000000000002E-3,null,"2014-04-01",4.5899999999999999E-4,"2014-04-01",4.5899999999999999E-4,null,"2019-12-01",1.2200000000000001E-2,"2019-12-01",1.2200000000000001E-2,null,null,null,null,null,null,"2009-04-01",2.921E-3,3.7290000000000001E-3,4.529E-3,5.3229999999999996E-3,null,"2014-04-01",4.5899999999999999E-4,null,"2014-04-01",2.4659999999999999E-3,3.2729999999999999E-3,4.0740000000000004E-3,4.8669999999999998E-3,null,168,{"$error":"#REF!"},{"$error":"#REF!"},{"$error":"#REF!"},{"$error":"#REF!"},{"$error":"#REF!"},null,null,null,null,null,null,null,null,null,null,null,null,null,null,null,null,null,"2009-04-01",5.0000000000000001E-3,"2009-04-01",5.0000000000000001E-3,null,"2009-04-01",8.3999999999999995E-3,"2009-04-01","2009-04-01",8.3999999999999995E-3,null,"2009-04-01","2009-04-01","","","",8.3999999999999995E-3,8.3999999999999995E-3,1.0417999999999998,null,null,null,null,null,null,null,null,null,null,null,"",null,"2014-04-01",4.5899999999999999E-4,null,"2014-04-01",5.4612949999999216E-3]
[null,"2013-05-01",678,"2013-05-01",678,null,"2014-05-01",5.7999999999999996E-3,"2014-05-01",5.7999999999999996E-3,null,"2014-05-01",4.5999999999999999E-3,"2014-05-01",4.5999999999999999E-3,null,"2014-05-01",6.0400000000000004E-4,"2014-05-01",6.0400000000000004E-4,null,"2020-01-01",1.9E-3,"2020-01-01",1.9E-3,null,null,null,null,null,null,"2009-05-01",2.9160000000000002E-3,3.7239999999999999E-3,4.5240000000000002E-3,5.3179999999999998E-3,null,"2014-05-01",6.0400000000000004E-4,null,"2014-05-01",2.4659999999999999E-3,3.2729999999999999E-3,4.0740000000000004E-3,4.8669999999999998E-3,null,169,{"$error":"#REF!"},{"$error":"#REF!"},{"$error":"#REF!"},{"$error":"#REF!"},{"$error":"#REF!"},null,null,null,null,null,null,null,null,null,null,null,null,null,null,null,null,null,"2009-05-01",5.0000000000000001E-3,"2009-05-01",5.0000000000000001E-3,null,"2009-05-01",7.7000000000000002E-3,"2009-05-01","2009-05-01",7.7000000000000002E-3,null,"2009-05-01","2009-05-01","","","",7.7000000000000002E-3,7.7000000000000002E-3,1.0340999999999998,null,null,null,null,null,null,null,null,null,null,null,"",null,"2014-05-01",6.0400000000000004E-4,null,"2014-05-01",5.6070200000000181E-3]
[null,"2013-06-01",678,"2013-06-01",678,null,"2014-06-01",4.7000000000000002E-3,"2014-06-01",4.7000000000000002E-3,null,"2014-06-01",4.0000000000000001E-3,"2014-06-01",4.0000000000000001E-3,null,"2014-06-01",4.6500000000000003E-4,"2014-06-01",4.6500000000000003E-4,null,"2020-02-01",1.6999999999999999E-3,"2020-02-01",1.6999999999999999E-3,null,null,null,null,null,null,"2009-06-01",3.1229999999999999E-3,3.9309999999999996E-3,4.7320000000000001E-3,5.5259999999999997E-3,null,"2014-06-01",4.6500000000000003E-4,null,"2014-06-01",2.4659999999999999E-3,3.2729999999999999E-3,4.0740000000000004E-3,4.8669999999999998E-3,null,170,{"$error":"#REF!"},{"$error":"#REF!"},{"$error":"#REF!"},{"$error":"#REF!"},{"$error":"#REF!"},null,null,null,null,null,null,null,null,null,null,null,null,null,null,null,null,null,"2009-06-01",5.0000000000000001E-3,"2009-06-01",5.0000000000000001E-3,null,"2009-06-01",7.6E-3,"2009-06-01","2009-06-01",7.6E-3,null,"2009-06-01","2009-06-01","","","",7.6E-3,7.6E-3,1.0264999999999997,null,null,null,null,null,null,null,null,null,null,null,"",null,"2014-06-01",4.6500000000000003E-4,null,"2014-06-01",5.4673249999999118E-3]
[null,"2013-07-01",678,"2013-07-01",678,null,"2014-07-01",1.6999999999999999E-3,"2014-07-01",1.6999999999999999E-3,null,"2014-07-01",1E-4,"2014-07-01",1E-4,null,"2014-07-01",1.054E-3,"2014-07-01",1.054E-3,null,"2020-02-01",1.8E-3,"2020-02-01",1.8E-3,null,null,null,null,null,null,"2009-07-01",3.519E-3,4.3280000000000002E-3,5.1289999999999999E-3,5.9230000000000003E-3,null,"2014-07-01",1.054E-3,null,"2014-07-01",2.4659999999999999E-3,3.2729999999999999E-3,4.0740000000000004E-3,4.8669999999999998E-3,null,171,{"$error":"#REF!"},{"$error":"#REF!"},{"$error":"#REF!"},{"$error":"#REF!"},{"$error":"#REF!"},null,null,null,null,null,null,null,null,null,null,null,null,null,null,null,null,null,"2009-07-01",5.0000000000000001E-3,"2009-07-01",5.0000000000000001E-3,null,"2009-07-01",7.9000000000000008E-3,"2009-07-01","2009-07-01",7.9000000000000008E-3,null,"2009-07-01","2009-07-01","","",{"$f":"+IF(OR(COD_JUROS<>3,CD170=\"\"),\"\",BU171)","v":""},7.9000000000000008E-3,7.9000000000000008E-3,1.0185999999999997,null,null,null,null,null,null,null,null,null,null,null,"",null,"2014-07-01",1.054E-3,null,"2014-07-01",6.05926999999995E-3]
[null,"2013-08-01",678,"2013-08-01",678,null,"2014-08-01",1.4E-3,"2014-08-01",1.4E-3,null,"2014-08-01",2.5000000000000001E-3,"2014-08-01",2.5000000000000001E-3,null,"2014-08-01",6.02E-4,"2014-08-01",6.02E-4,null,"2020-03-01",-2.3E-3,"2020-03-01",-2.3E-3,null,null,null,null,null,null,"2009-08-01",2.663E-3,3.4710000000000001E-3,4.2709999999999996E-3,5.0650000000000001E-3,null,"2014-08-01",6.02E-4,null,"2014-08-01",2.4659999999999999E-3,3.2729999999999999E-3,4.0740000000000004E-3,4.8669999999999998E-3,null,172,{"$error":"#REF!"},{"$error":"#REF!"},{"$error":"#REF!"},{"$error":"#REF!"},{"$error":"#REF!"},null,null,null,null,null,null,null,null,null,null,null,null,null,null,null,null,null,"2009-08-01",5.0000000000000001E-3,"2009-08-01",5.0000000000000001E-3,null,"2009-08-01",6.8999999999999999E-3,"2009-08-01","2009-08-01",6.8999999999999999E-3,null,"2009-08-01","2009-08-01","","","",6.8999999999999999E-3,6.8999999999999999E-3,1.0116999999999998,null,null,null,null,null,null,null,null,null,null,null,"",null,"2014-08-01",6.02E-4,null,"2014-08-01",5.6050099999997993E-3]
[null,"2013-09-01",678,"2013-09-01",678,null,"2014-09-01",3.8999999999999998E-3,"2014-09-01",3.8999999999999998E-3,null,"2014-09-01",5.7000000000000002E-3,"2014-09-01",5.7000000000000002E-3,null,"2014-09-01",8.7299999999999997E-4,"2014-09-01",8.7299999999999997E-4,null,"2020-04-01",-2.5000000000000001E-3,"2020-04-01",-2.5000000000000001E-3,null,null,null,null,null,null,"2009-09-01",2.4659999999999999E-3,3.2729999999999999E-3,4.0740000000000004E-3,4.8669999999999998E-3,null,"2014-09-01",8.7299999999999997E-4,null,"2014-09-01",2.4659999999999999E-3,3.2729999999999999E-3,4.0740000000000004E-3,4.8669999999999998E-3,null,173,{"$error":"#REF!"},{"$error":"#REF!"},{"$error":"#REF!"},{"$error":"#REF!"},{"$error":"#REF!"},null,null,null,null,null,null,null,null,null,null,null,null,null,null,null,null,null,"2009-09-01",5.0000000000000001E-3,"2009-09-01",5.0000000000000001E-3,null,"2009-09-01",6.8999999999999999E-3,"2009-09-01","2009-09-01",6.8999999999999999E-3,null,"2009-09-01","2009-09-01","","","",6.8999999999999999E-3,6.8999999999999999E-3,1.0047999999999999,null,null,null,null,null,null,null,null,null,null,null,"",null,"2014-09-01",8.7299999999999997E-4,null,"2014-09-01",5.8773649999996902E-3]
[null,"2013-10-01",678,"2013-10-01",678,null,"2014-10-01",4.7999999999999996E-3,"2014-10-01",4.7999999999999996E-3,null,"2014-10-01",4.1999999999999997E-3,"2014-10-01",4.1999999999999997E-3,null,"2014-10-01",1.0380000000000001E-3,"2014-10-01",1.0380000000000001E-3,null,"2020-05-01",3.0000000000000001E-3,"2020-05-01",3.0000000000000001E-3,null,null,null,null,null,null,"2009-10-01",2.4659999999999999E-3,3.2729999999999999E-3,4.0740000000000004E-3,4.8669999999999998E-3,null,"2014-10-01",1.0380000000000001E-3,null,"2014-10-01",2.4659999999999999E-3,3.2729999999999999E-3,4.0740000000000004E-3,4.8669999999999998E-3,null,174,{"$error":"#REF!"},{"$error":"#REF!"},{"$error":"#REF!"},{"$error":"#REF!"},{"$error":"#REF!"},null,null,null,null,null,null,null,null,null,null,null,null,null,null,null,null,null,"2009-10-01",5.0000000000000001E-3,"2009-10-01",5.0000000000000001E-3,null,"2009-10-01",6.8999999999999999E-3,"2009-10-01","2009-10-01",6.8999999999999999E-3,null,"2009-10-01","2009-10-01","","","",6.8999999999999999E-3,6.8999999999999999E-3,0.99790000000000001,null,null,null,null,null,null,null,null,null,null,null,"",null,"2014-10-01",1.0380000000000001E-3,null,"2014-10-01",6.0431899999999761E-3]
[null,"2013-11-01",678,"2013-11-01",678,null,"2014-11-01",3.8E-3,"2014-11-01",3.8E-3,null,"2014-11-01",5.1000000000000004E-3,"2014-11-01",5.1000000000000004E-3,null,"2014-11-01",4.8299999999999998E-4,"2014-11-01",4.8299999999999998E-4,null,"2020-06-01",4.4000000000000003E-3,"2020-06-01",4.4000000000000003E-3,null,null,null,null,null,null,"2009-11-01",2.4659999999999999E-3,3.2729999999999999E-3,4.0740000000000004E-3,4.8669999999999998E-3,null,{"$f":"+S175","v":"2014-11-01"},{"$f":"+T175","v":4.8299999999999998E-4},null,"2014-11-01",2.4659999999999999E-3,3.2729999999999999E-3,4.0740000000000004E-3,4.8669999999999998E-3,null,175,{"$error":"#REF!"},{"$error":"#REF!"},{"$error":"#REF!"},{"$error":"#REF!"},{"$error":"#REF!"},null,null,null,null,null,null,null,null,null,null,null,null,null,null,null,null,null,"2009-11-01",5.0000000000000001E-3,"2009-11-01",5.0000000000000001E-3,null,"2009-11-01",6.6E-3,"2009-11-01","2009-11-01",6.6E-3,null,"2009-11-01","2009-11-01","","","",6.6E-3,6.6E-3,0.99129999999999996,null,null,null,null,null,null,null,null,null,null,null,"",null,"2014-11-01",4.8299999999999998E-4,null,"2014-11-01",5.4854149999998825E-3]
[null,"2013-12-01",678,"2013-12-01",678,null,"2014-12-01",7.9000000000000008E-3,"2014-12-01",7.9000000000000008E-3,null,"2014-12-01",7.7999999999999996E-3,"2014-12-01",7.7999999999999996E-3,null,"2014-12-01",1.0529999999999999E-3,"2014-12-01",1.0529999999999999E-3,null,"2020-07-01",3.5999999999999999E-3,"2020-07-01",3.5999999999999999E-3,null,"2010-01-10",3.0000000000000001E-3,3.8080000000000002E-3,4.6090000000000002E-3,5.4029999999999998E-3,{"$f":"+IF(AND(TRIM(AA176)=\"\",TRIM(AA175)<>\"\"),EDATE(AF175,1),IF(TRIM(AA176)=\"\",\"\",EOMONTH(AA176,-2)+1))","v":"2009-12-01"},{"$f":"IF(TRIM(AB176)=\"\",\"\",AB176)","v":3.0000000000000001E-3},{"$f":"IF(TRIM(AC176)=\"\",\"\",AC176)","v":3.8080000000000002E-3},{"$f":"IF(TRIM(AD176)=\"\",\"\",AD176)","v":4.6090000000000002E-3},{"$f":"IF(TRIM(AE176)=\"\",\"\",AE176)","v":5.4029999999999998E-3},null,"2014-12-01",1.0529999999999999E-3,null,"2014-12-01",2.4659999999999999E-3,3.2729999999999999E-3,4.0740000000000004E-3,4.8669999999999998E-3,null,176,{"$error":"#REF!"},{"$error":"#REF!"},{"$error":"#REF!"},{"$error":"#REF!"},{"$error":"#REF!"},null,null,null,null,null,null,null,null,null,null,null,null,null,null,null,null,null,"2009-12-01",5.0000000000000001E-3,"2009-12-01",5.0000000000000001E-3,null,"2009-12-01",7.3000000000000001E-3,"2009-12-01","2009-12-01",7.3000000000000001E-3,null,"2009-12-01","2009-12-01","","","",7.3000000000000001E-3,7.3000000000000001E-3,0.98399999999999999,null,null,null,null,null,null,null,null,null,null,null,"",null,"2014-12-01",1.0529999999999999E-3,null,"2014-12-01",6.0582649999998406E-3]
[null,"2014-01-01",724,"2014-01-01",724,null,"2015-01-01",8.8999999999999999E-3,"2015-01-01",8.8999999999999999E-3,null,"2015-01-01",1.24E-2,{"$f":"+IF(TRIM(L177)=\"\",\"\",TRUNC(L177,0))","v":"2015-01-01"},1.24E-2,null,"2015-01-01",8.7799999999999998E-4,"2015-01-01",8.7799999999999998E-4,null,"2020-08-01",8.6999999999999994E-3,"2020-08-01",8.6999999999999994E-3,null,"2010-02-10",2.4659999999999999E-3,3.2729999999999999E-3,4.0740000000000004E-3,4.8669999999999998E-3,"2010-01-01",{"$f":"IF(TRIM(AB177)=\"\",\"\",AB177)","v":2.4659999999999999E-3},{"$f":"IF(TRIM(AC177)=\"\",\"\",AC177)","v":3.2729999999999999E-3},{"$f":"IF(TRIM(AD177)=\"\",\"\",AD177)","v":4.0740000000000004E-3},{"$f":"IF(TRIM(AE177)=\"\",\"\",AE177)","v":4.8669999999999998E-3},null,"2015-01-01",8.7799999999999998E-4,null,"2015-01-01",2.4659999999999999E-3,3.2729999999999999E-3,4.0740000000000004E-3,4.8669999999999998E-3,null,177,{"$error":"#REF!"},{"$error":"#REF!"},{"$error":"#REF!"},{"$error":"#REF!"},{"$error":"#REF!"},null,null,null,null,null,null,null,null,null,null,null,null,null,null,null,null,null,"2010-01-01",5.0000000000000001E-3,"2010-01-01",5.0000000000000001E-3,null,"2010-01-01",6.6E-3,"2010-01-01","2010-01-01",6.6E-3,null,"2010-01-01","2010-01-01","","","",6.6E-3,6.6E-3,0.97739999999999994,null,null,null,null,null,null,null,null,null,null,null,"",null,"2015-01-01",8.7799999999999998E-4,null,"2015-01-01",5.8823899999997931E-3]
[null,"2014-02-01",724,"2014-02-01",724,null,"2015-02-01",1.3299999999999999E-2,"2015-02-01",1.3299999999999999E-2,null,"2015-02-01",1.2200000000000001E-2,{"$f":"+IF(TRIM(L178)=\"\",\"\",TRUNC(L178,0))","v":"2015-02-01"},1.2200000000000001E-2,null,"2015-02-01",1.6799999999999999E-4,"2015-02-01",1.6799999999999999E-4,null,"2020-09-01",8.8999999999999999E-3,"2020-09-01",8.8999999999999999E-3,null,"2010-03-10",2.4659999999999999E-3,3.2729999999999999E-3,4.0740000000000004E-3,4.8669999999999998E-3,"2010-02-01",2.4659999999999999E-3,3.2729999999999999E-3,4.0740000000000004E-3,4.8669999999999998E-3,null,"2015-02-01",1.6799999999999999E-4,null,"2015-02-01",2.4659999999999999E-3,3.2729999999999999E-3,4.0740000000000004E-3,4.8669999999999998E-3,null,178,{"$error":"#REF!"},{"$error":"#REF!"},{"$error":"#REF!"},{"$error":"#REF!"},{"$error":"#REF!"},null,null,null,null,null,null,null,null,null,null,null,null,null,null,null,null,null,"2010-02-01",5.0000000000000001E-3,"2010-02-01",5.0000000000000001E-3,null,"2010-02-01",5.8999999999999999E-3,"2010-02-01","2010-02-01",5.8999999999999999E-3,null,"2010-02-01","2010-02-01","","","",5.8999999999999999E-3,5.8999999999999999E-3,0.97149999999999992,null,null,null,null,null,null,null,null,null,null,null,"",null,"2015-02-01",1.6799999999999999E-4,null,"2015-02-01",5.1688399999998413E-3]
[null,"2014-03-01",724,"2014-03-01",724,null,"2015-03-01",1.24E-2,"2015-03-01",1.24E-2,null,"2015-03-01",1.32E-2,{"$f":"+IF(AND(M179=\"\",M178<>\"\"),EDATE(N178,1),IF(TRIM(L179)=\"\",\"\",TRUNC(L179,0)))","v":"2015-03-01"},1.32E-2,null,"2015-03-01",1.2960000000000001E-3,"2015-03-01",1.2960000000000001E-3,null,"2020-10-01",9.4999999999999998E-3,"2020-10-01",9.4999999999999998E-3,null,"2010-04-10",3.2599999999999999E-3,4.0679999999999996E-3,4.8690000000000001E-3,5.6629999999999996E-3,"2010-03-01",3.2599999999999999E-3,4.0679999999999996E-3,4.8690000000000001E-3,5.6629999999999996E-3,null,"2015-03-01",1.2960000000000001E-3,null,"2015-03-01",2.4659999999999999E-3,3.2729999999999999E-3,4.0740000000000004E-3,4.8669999999999998E-3,null,179,{"$error":"#REF!"},{"$error":"#REF!"},{"$error":"#REF!"},{"$error":"#REF!"},{"$error":"#REF!"},null,null,null,null,null,null,null,null,null,null,null,null,null,null,null,null,null,"2010-03-01",5.0000000000000001E-3,"2010-03-01",5.0000000000000001E-3,null,"2010-03-01",7.6E-3,"2010-03-01","2010-03-01",7.6E-3,null,"2010-03-01","2010-03-01","","","",7.6E-3,7.6E-3,0.96389999999999987,null,null,null,null,null,null,null,null,null,null,null,"",null,"2015-03-01",1.2960000000000001E-3,null,"2015-03-01",6.3024799999997771E-3]
[null,"2014-04-01",724,"2014-04-01",724,null,"2015-04-01",1.0699999999999999E-2,"2015-04-01",1.0699999999999999E-2,null,"2015-04-01",7.1000000000000004E-3,"2015-04-01",7.1000000000000004E-3,null,"2015-04-01",1.0740000000000001E-3,"2015-04-01",1.0740000000000001E-3,null,"2020-11-01",1.46E-2,"2020-11-01",1.46E-2,null,"2010-05-10",2.4659999999999999E-3,3.2729999999999999E-3,4.0740000000000004E-3,4.8669999999999998E-3,"2010-04-01",2.4659999999999999E-3,3.2729999999999999E-3,4.0740000000000004E-3,4.8669999999999998E-3,null,"2015-04-01",1.0740000000000001E-3,null,"2015-04-01",2.4659999999999999E-3,3.2729999999999999E-3,4.0740000000000004E-3,4.8669999999999998E-3,null,180,{"$error":"#REF!"},{"$error":"#REF!"},{"$error":"#REF!"},{"$error":"#REF!"},{"$error":"#REF!"},null,null,null,null,null,null,null,null,null,null,null,null,null,null,null,null,null,"2010-04-01",5.0000000000000001E-3,"2010-04-01",5.0000000000000001E-3,null,"2010-04-01",6.7000000000000002E-3,"2010-04-01","2010-04-01",6.7000000000000002E-3,null,"2010-04-01","2010-04-01","","","",6.7000000000000002E-3,6.7000000000000002E-3,0.95719999999999983,null,null,null,null,null,null,null,null,null,null,null,"",null,{"$f":"+I180","v":"2015-04-01"},{"$f":"+J180","v":1.0699999999999999E-2},null,"2015-04-01",6.0793699999999173E-3]
[null,"2014-05-01",724,"2014-05-01",724,null,"2015-05-01",6.0000000000000001E-3,"2015-05-01",6.0000000000000001E-3,null,"2015-05-01",7.4000000000000003E-3,"2015-05-01",7.4000000000000003E-3,null,"2015-05-01",1.1529999999999999E-3,"2015-05-01",1.1529999999999999E-3,null,"2020-12-01",2.7000000000000001E-3,"2020-12-01",2.7000000000000001E-3,null,"2010-06-10",2.977E-3,3.7850000000000002E-3,4.5859999999999998E-3,5.3800000000000002E-3,"2010-05-01",2.977E-3,3.7850000000000002E-3,4.5859999999999998E-3,5.3800000000000002E-3,null,"2015-05-01",1.1529999999999999E-3,null,"2015-05-01",2.4659999999999999E-3,3.2729999999999999E-3,4.0740000000000004E-3,4.8669999999999998E-3,null,181,{"$error":"#REF!"},{"$error":"#REF!"},{"$error":"#REF!"},{"$error":"#REF!"},{"$error":"#REF!"},null,null,null,null,null,null,null,null,null,null,null,null,null,null,null,null,null,"2010-05-01",5.0000000000000001E-3,"2010-05-01",5.0000000000000001E-3,null,"2010-05-01",7.4999999999999997E-3,"2010-05-01","2010-05-01",7.4999999999999997E-3,null,"2010-05-01","2010-05-01","","","",7.4999999999999997E-3,7.4999999999999997E-3,0.94969999999999988,null,null,null,null,null,null,null,null,null,null,null,"",null,"2015-05-01",6.0000000000000001E-3,null,"2015-05-01",6.1587649999998995E-3]
[null,"2014-06-01",724,"2014-06-01",724,null,"2015-06-01",9.9000000000000008E-3,"2015-06-01",9.9000000000000008E-3,null,"2015-06-01",7.9000000000000008E-3,"2015-06-01",7.9000000000000008E-3,null,"2015-06-01",1.8129999999999999E-3,"2015-06-01",1.8129999999999999E-3,null,"2021-01-01",8.2000000000000007E-3,"2021-01-01",8.2000000000000007E-3,null,"2010-07-10",3.0560000000000001E-3,3.8639999999999998E-3,4.6649999999999999E-3,5.4590000000000003E-3,"2010-06-01",3.0560000000000001E-3,3.8639999999999998E-3,4.6649999999999999E-3,5.4590000000000003E-3,null,"2015-06-01",1.8129999999999999E-3,null,"2015-06-01",2.4659999999999999E-3,3.2729999999999999E-3,4.0740000000000004E-3,4.8669999999999998E-3,null,182,{"$error":"#REF!"},{"$error":"#REF!"},{"$error":"#REF!"},{"$error":"#REF!"},{"$error":"#REF!"},null,null,null,null,null,null,null,null,null,null,null,null,null,null,null,null,null,"2010-06-01",5.0000000000000001E-3,"2010-06-01",5.0000000000000001E-3,null,"2010-06-01",7.9000000000000008E-3,"2010-06-01","2010-06-01",7.9000000000000008E-3,null,"2010-06-01","2010-06-01","","","",7.9000000000000008E-3,7.9000000000000008E-3,0.94179999999999986,null,null,null,null,null,null,null,null,null,null,null,"",null,"2015-06-01",9.9000000000000008E-3,null,"2015-06-01",6.8220649999999328E-3]
[null,"2014-07-01",724,"2014-07-01",724,null,"2015-07-01",5.8999999999999999E-3,"2015-07-01",5.8999999999999999E-3,null,"2015-07-01",6.1999999999999998E-3,"2015-07-01",6.1999999999999998E-3,null,"2015-07-01",2.3050000000000002E-3,"2015-07-01",2.3050000000000002E-3,null,"2021-02-01",8.6E-3,"2021-02-01",8.6E-3,null,"2010-08-10",3.62E-3,4.4279999999999996E-3,5.2290000000000001E-3,6.0239999999999998E-3,"2010-07-01",3.62E-3,4.4279999999999996E-3,5.2290000000000001E-3,6.0239999999999998E-3,null,"2015-07-01",2.3050000000000002E-3,null,"2015-07-01",2.4659999999999999E-3,3.2729999999999999E-3,4.0740000000000004E-3,4.8669999999999998E-3,null,183,{"$error":"#REF!"},{"$error":"#REF!"},{"$error":"#REF!"},{"$error":"#REF!"},{"$error":"#REF!"},null,null,null,null,null,null,null,null,null,null,null,null,null,null,null,null,null,"2010-07-01",5.0000000000000001E-3,"2010-07-01",5.0000000000000001E-3,null,"2010-07-01",8.6E-3,"2010-07-01","2010-07-01",8.6E-3,null,"2010-07-01","2010-07-01","","","",8.6E-3,8.6E-3,0.93319999999999981,null,null,null,null,null,null,null,null,null,null,null,"",null,"2015-07-01",5.8999999999999999E-3,null,"2015-07-01",7.3165249999997961E-3]
[null,"2014-08-01",724,"2014-08-01",724,null,"2015-08-01",4.3E-3,"2015-08-01",4.3E-3,null,"2015-08-01",2.2000000000000001E-3,"2015-08-01",2.2000000000000001E-3,null,"2015-08-01",1.867E-3,"2015-08-01",1.867E-3,null,null,null,"2021-03-01",0,null,"2010-09-10",3.3769999999999998E-3,4.1850000000000004E-3,4.986E-3,5.7800000000000004E-3,"2010-08-01",3.3769999999999998E-3,4.1850000000000004E-3,4.986E-3,5.7800000000000004E-3,null,"2015-08-01",1.867E-3,null,"2015-08-01",2.4659999999999999E-3,3.2729999999999999E-3,4.0740000000000004E-3,4.8669999999999998E-3,null,184,{"$error":"#REF!"},{"$error":"#REF!"},{"$error":"#REF!"},{"$error":"#REF!"},{"$error":"#REF!"},null,null,null,null,null,null,null,null,null,null,null,null,null,null,null,null,null,"2010-08-01",5.0000000000000001E-3,"2010-08-01",5.0000000000000001E-3,null,"2010-08-01",8.8999999999999999E-3,"2010-08-01","2010-08-01",8.8999999999999999E-3,null,"2010-08-01","2010-08-01","","","",8.8999999999999999E-3,8.8999999999999999E-3,0.92429999999999979,null,null,null,null,null,null,null,null,null,null,null,"",null,"2015-08-01",4.3E-3,null,"2015-08-01",6.8763350000000667E-3]
[null,"2014-09-01",724,"2014-09-01",724,null,"2015-09-01",3.8999999999999998E-3,"2015-09-01",3.8999999999999998E-3,null,"2015-09-01",5.4000000000000003E-3,"2015-09-01",5.4000000000000003E-3,null,"2015-09-01",1.92E-3,"2015-09-01",1.92E-3,null,null,null,"","",null,"2010-10-10",3.1689999999999999E-3,3.9779999999999998E-3,4.7780000000000001E-3,5.5719999999999997E-3,"2010-09-01",3.1689999999999999E-3,3.9779999999999998E-3,4.7780000000000001E-3,5.5719999999999997E-3,null,"2015-09-01",1.92E-3,null,"2015-09-01",2.4659999999999999E-3,3.2729999999999999E-3,4.0740000000000004E-3,4.8669999999999998E-3,null,185,{"$error":"#REF!"},{"$error":"#REF!"},{"$error":"#REF!"},{"$error":"#REF!"},{"$error":"#REF!"},null,null,null,null,null,null,null,null,null,null,null,null,null,null,null,null,null,"2010-09-01",5.0000000000000001E-3,"2010-09-01",5.0000000000000001E-3,null,"2010-09-01",8.5000000000000006E-3,"2010-09-01","2010-09-01",8.5000000000000006E-3,null,"2010-09-01","2010-09-01","","","",8.5000000000000006E-3,8.5000000000000006E-3,0.91579999999999984,null,null,null,null,null,null,null,null,null,null,null,"",null,"2015-09-01",3.8999999999999998E-3,null,"2015-09-01",6.9295999999998692E-3]
[null,"2014-10-01",724,"2014-10-01",724,null,"2015-10-01",6.6E-3,"2015-10-01",6.6E-3,null,"2015-10-01",8.2000000000000007E-3,"2015-10-01",8.2000000000000007E-3,null,"2015-10-01",1.7899999999999999E-3,"2015-10-01",1.7899999999999999E-3,null,null,null,"","",null,"2010-11-10",2.9390000000000002E-3,3.7469999999999999E-3,4.548E-3,5.3410000000000003E-3,"2010-10-01",2.9390000000000002E-3,3.7469999999999999E-3,4.548E-3,5.3410000000000003E-3,null,"2015-10-01",1.7899999999999999E-3,null,"2015-10-01",2.4659999999999999E-3,3.2729999999999999E-3,4.0740000000000004E-3,4.8669999999999998E-3,null,186,{"$error":"#REF!"},{"$error":"#REF!"},{"$error":"#REF!"},{"$error":"#REF!"},{"$error":"#REF!"},null,null,null,null,null,null,null,null,null,null,null,null,null,null,null,null,null,"2010-10-01",5.0000000000000001E-3,"2010-10-01",5.0000000000000001E-3,null,"2010-10-01",8.0999999999999996E-3,"2010-10-01","2010-10-01",8.0999999999999996E-3,null,"2010-10-01","2010-10-01","","","",8.0999999999999996E-3,8.0999999999999996E-3,0.90769999999999984,null,null,null,null,null,null,null,null,null,null,null,"",null,"2015-10-01",6.6E-3,null,"2015-10-01",6.7989499999998593E-3]
[null,"2014-11-01",724,"2014-11-01",724,null,"2015-11-01",8.5000000000000006E-3,"2015-11-01",8.5000000000000006E-3,null,"2015-11-01",1.01E-2,"2015-11-01",1.01E-2,null,"2015-11-01",1.297E-3,"2015-11-01",1.297E-3,null,null,null,"","",null,"2010-12-10",2.8029999999999999E-3,3.6099999999999999E-3,4.411E-3,5.2050000000000004E-3,"2010-11-01",2.8029999999999999E-3,3.6099999999999999E-3,4.411E-3,5.2050000000000004E-3,null,"2015-11-01",1.297E-3,null,"2015-11-01",2.4659999999999999E-3,3.2729999999999999E-3,4.0740000000000004E-3,4.8669999999999998E-3,null,187,{"$error":"#REF!"},{"$error":"#REF!"},{"$error":"#REF!"},{"$error":"#REF!"},{"$error":"#REF!"},null,null,null,null,null,null,null,null,null,null,null,null,null,null,null,null,null,"2010-11-01",5.0000000000000001E-3,"2010-11-01",5.0000000000000001E-3,null,"2010-11-01",8.0999999999999996E-3,"2010-11-01","2010-11-01",8.0999999999999996E-3,null,"2010-11-01","2010-11-01","","","",8.0999999999999996E-3,8.0999999999999996E-3,0.89959999999999984,null,null,null,null,null,null,null,null,null,null,null,"",null,"2015-11-01",8.5000000000000006E-3,null,"2015-11-01",6.3034849999998865E-3]
[null,"2014-12-01",724,"2014-12-01",724,null,"2015-12-01",1.18E-2,"2015-12-01",1.18E-2,null,"2015-12-01",9.5999999999999992E-3,"2015-12-01",9.5999999999999992E-3,null,"2015-12-01",2.2499999999999998E-3,"2015-12-01",2.2499999999999998E-3,null,null,null,"","",null,"2011-01-10",3.875E-3,4.6839999999999998E-3,5.4850000000000003E-3,6.28E-3,"2010-12-01",3.875E-3,4.6839999999999998E-3,5.4850000000000003E-3,6.28E-3,null,"2015-12-01",2.2499999999999998E-3,null,"2015-12-01",2.4659999999999999E-3,3.2729999999999999E-3,4.0740000000000004E-3,4.8669999999999998E-3,null,188,{"$error":"#REF!"},{"$error":"#REF!"},{"$error":"#REF!"},{"$error":"#REF!"},{"$error":"#REF!"},null,null,null,null,null,null,null,null,null,null,null,null,null,null,null,null,null,"2010-12-01",5.0000000000000001E-3,"2010-12-01",5.0000000000000001E-3,null,"2010-12-01",9.2999999999999992E-3,"2010-12-01","2010-12-01",9.2999999999999992E-3,null,"2010-12-01","2010-12-01","","","",9.2999999999999992E-3,9.2999999999999992E-3,0.89029999999999987,null,null,null,null,null,null,null,null,null,null,null,"",null,"2015-12-01",1.18E-2,null,"2015-12-01",7.2612499999999969E-3]
[null,"2015-01-01",788,"2015-01-01",788,null,"2016-01-01",9.1999999999999998E-3,"2016-01-01",9.1999999999999998E-3,null,"2016-01-01",1.2699999999999999E-2,"2016-01-01",1.2699999999999999E-2,null,"2016-01-01",1.32E-3,"2016-01-01",1.32E-3,null,null,null,"","",null,"2011-02-10",3.1830000000000001E-3,3.9909999999999998E-3,4.7920000000000003E-3,5.5859999999999998E-3,"2011-01-01",3.1830000000000001E-3,3.9909999999999998E-3,4.7920000000000003E-3,5.5859999999999998E-3,null,"2016-01-01",1.32E-3,null,"2016-01-01",2.4659999999999999E-3,3.2729999999999999E-3,4.0740000000000004E-3,4.8669999999999998E-3,null,189,{"$error":"#REF!"},{"$error":"#REF!"},{"$error":"#REF!"},{"$error":"#REF!"},{"$error":"#REF!"},null,null,null,null,null,null,null,null,null,null,null,null,null,null,null,null,null,"2011-01-01",5.0000000000000001E-3,"2011-01-01",5.0000000000000001E-3,null,"2011-01-01",8.6E-3,"2011-01-01","2011-01-01",8.6E-3,null,"2011-01-01","2011-01-01","","","",8.6E-3,8.6E-3,0.88169999999999982,null,null,null,null,null,null,null,null,null,null,null,"",null,"2016-01-01",9.1999999999999998E-3,null,"2016-01-01",6.32659999999996E-3]
[null,"2015-02-01",788,"2015-02-01",788,null,"2016-02-01",1.4200000000000001E-2,"2016-02-01",1.4200000000000001E-2,null,"2016-02-01",8.9999999999999993E-3,"2016-02-01",8.9999999999999993E-3,null,"2016-02-01",9.5699999999999995E-4,"2016-02-01",9.5699999999999995E-4,null,null,null,"","",null,"2011-03-10",2.9910000000000002E-3,3.7989999999999999E-3,4.5999999999999999E-3,5.3940000000000004E-3,"2011-02-01",2.9910000000000002E-3,3.7989999999999999E-3,4.5999999999999999E-3,5.3940000000000004E-3,null,"2016-02-01",9.5699999999999995E-4,null,"2016-02-01",2.4659999999999999E-3,3.2729999999999999E-3,4.0740000000000004E-3,4.8669999999999998E-3,null,190,{"$error":"#REF!"},{"$error":"#REF!"},{"$error":"#REF!"},{"$error":"#REF!"},{"$error":"#REF!"},null,null,null,null,null,null,null,null,null,null,null,null,null,null,null,null,null,"2011-02-01",5.0000000000000001E-3,"2011-02-01",5.0000000000000001E-3,null,"2011-02-01",8.3999999999999995E-3,"2011-02-01","2011-02-01",8.3999999999999995E-3,null,"2011-02-01","2011-02-01","","","",8.3999999999999995E-3,8.3999999999999995E-3,0.87329999999999985,null,null,null,null,null,null,null,null,null,null,null,"",null,"2016-02-01",1.4200000000000001E-2,null,"2016-02-01",5.9617849999999972E-3]
[null,"2015-03-01",788,"2015-03-01",788,null,"2016-03-01",4.3E-3,"2016-03-01",4.3E-3,null,"2016-03-01",4.3E-3,"2016-03-01",4.3E-3,null,"2016-03-01",2.1679999999999998E-3,"2016-03-01",2.1679999999999998E-3,null,null,null,"","",null,"2011-04-10",3.6809999999999998E-3,4.4889999999999999E-3,5.2909999999999997E-3,6.0850000000000001E-3,"2011-03-01",3.6809999999999998E-3,4.4889999999999999E-3,5.2909999999999997E-3,6.0850000000000001E-3,null,"2016-03-01",2.1679999999999998E-3,null,"2016-03-01",2.4659999999999999E-3,3.2729999999999999E-3,4.0740000000000004E-3,4.8669999999999998E-3,null,191,{"$error":"#REF!"},{"$error":"#REF!"},{"$error":"#REF!"},{"$error":"#REF!"},{"$error":"#REF!"},null,null,null,null,null,null,null,null,null,null,null,null,null,null,null,null,null,"2011-03-01",5.0000000000000001E-3,"2011-03-01",5.0000000000000001E-3,null,"2011-03-01",9.1999999999999998E-3,"2011-03-01","2011-03-01",9.1999999999999998E-3,null,"2011-03-01","2011-03-01","","","",9.1999999999999998E-3,9.1999999999999998E-3,0.86409999999999987,null,null,null,null,null,null,null,null,null,null,null,"",null,"2016-03-01",4.3E-3,null,"2016-03-01",7.1788399999999086E-3]
[null,"2015-04-01",788,"2015-04-01",788,null,"2016-04-01",5.1000000000000004E-3,"2016-04-01",5.1000000000000004E-3,null,"2016-04-01",6.1000000000000004E-3,"2016-04-01",6.1000000000000004E-3,null,"2016-04-01",1.304E-3,"2016-04-01",1.304E-3,null,null,null,"","",null,"2011-05-10",2.836E-3,3.643E-3,4.444E-3,5.2379999999999996E-3,"2011-04-01",2.836E-3,3.643E-3,4.444E-3,5.2379999999999996E-3,null,"2016-04-01",1.304E-3,null,"2016-04-01",2.4659999999999999E-3,3.2729999999999999E-3,4.0740000000000004E-3,4.8669999999999998E-3,null,192,{"$error":"#REF!"},{"$error":"#REF!"},{"$error":"#REF!"},{"$error":"#REF!"},{"$error":"#REF!"},null,null,null,null,null,null,null,null,null,null,null,null,null,null,null,null,null,"2011-04-01",5.0000000000000001E-3,"2011-04-01",5.0000000000000001E-3,null,"2011-04-01",8.3999999999999995E-3,"2011-04-01","2011-04-01",8.3999999999999995E-3,null,"2011-04-01","2011-04-01","","","",8.3999999999999995E-3,8.3999999999999995E-3,0.85569999999999991,null,null,null,null,null,null,null,null,null,null,null,"",null,"2016-04-01",5.1000000000000004E-3,null,"2016-04-01",6.3105199999997641E-3]
[null,"2015-05-01",788,"2015-05-01",788,null,"2016-05-01",8.6E-3,"2016-05-01",8.6E-3,null,"2016-05-01",7.7999999999999996E-3,"2016-05-01",7.7999999999999996E-3,null,"2016-05-01",1.5330000000000001E-3,"2016-05-01",1.5330000000000001E-3,null,null,null,"","",null,"2011-06-10",4.0400000000000002E-3,4.8479999999999999E-3,5.6499999999999996E-3,6.4450000000000002E-3,"2011-05-01",4.0400000000000002E-3,4.8479999999999999E-3,5.6499999999999996E-3,6.4450000000000002E-3,null,"2016-05-01",1.5330000000000001E-3,null,"2016-05-01",2.4659999999999999E-3,3.2729999999999999E-3,4.0740000000000004E-3,4.8669999999999998E-3,null,193,{"$error":"#REF!"},{"$error":"#REF!"},{"$error":"#REF!"},{"$error":"#REF!"},{"$error":"#REF!"},null,null,null,null,null,null,null,null,null,null,null,null,null,null,null,null,null,"2011-05-01",5.0000000000000001E-3,"2011-05-01",5.0000000000000001E-3,null,"2011-05-01",9.9000000000000008E-3,"2011-05-01","2011-05-01",9.9000000000000008E-3,null,"2011-05-01","2011-05-01","","","",9.9000000000000008E-3,9.9000000000000008E-3,0.84579999999999989,null,null,null,null,null,null,null,null,null,null,null,"",null,"2016-05-01",8.6E-3,null,"2016-05-01",6.5406649999999456E-3]
[null,"2015-06-01",788,"2015-06-01",788,null,"2016-06-01",4.0000000000000001E-3,"2016-06-01",4.0000000000000001E-3,null,"2016-06-01",3.5000000000000001E-3,"2016-06-01",3.5000000000000001E-3,null,"2016-06-01",2.0430000000000001E-3,"2016-06-01",2.0430000000000001E-3,null,null,null,"","",null,"2011-07-10",3.5829999999999998E-3,4.3909999999999999E-3,5.1919999999999996E-3,5.986E-3,"2011-06-01",3.5829999999999998E-3,4.3909999999999999E-3,5.1919999999999996E-3,5.986E-3,null,"2016-06-01",2.0430000000000001E-3,null,"2016-06-01",2.4659999999999999E-3,3.2729999999999999E-3,4.0740000000000004E-3,4.8669999999999998E-3,null,194,{"$error":"#REF!"},{"$error":"#REF!"},{"$error":"#REF!"},{"$error":"#REF!"},{"$error":"#REF!"},null,null,null,null,null,null,null,null,null,null,null,null,null,null,null,null,null,"2011-06-01",5.0000000000000001E-3,"2011-06-01",5.0000000000000001E-3,null,"2011-06-01",9.5999999999999992E-3,"2011-06-01","2011-06-01",9.5999999999999992E-3,null,"2011-06-01","2011-06-01","","","",9.5999999999999992E-3,9.5999999999999992E-3,0.83619999999999983,null,null,null,null,null,null,null,null,null,null,null,"",null,"2016-06-01",4.0000000000000001E-3,null,"2016-06-01",7.0532150000000016E-3]
[null,"2015-07-01",788,"2015-07-01",788,null,"2016-07-01",5.4000000000000003E-3,"2016-07-01",5.4000000000000003E-3,null,"2016-07-01",5.1999999999999998E-3,"2016-07-01",5.1999999999999998E-3,null,"2016-07-01",1.621E-3,"2016-07-01",1.621E-3,null,null,null,"","",null,"2011-08-10",3.6979999999999999E-3,4.5059999999999996E-3,5.3080000000000002E-3,6.1019999999999998E-3,"2011-07-01",3.6979999999999999E-3,4.5059999999999996E-3,5.3080000000000002E-3,6.1019999999999998E-3,null,"2016-07-01",1.621E-3,null,"2016-07-01",2.4659999999999999E-3,3.2729999999999999E-3,4.0740000000000004E-3,4.8669999999999998E-3,null,195,{"$error":"#REF!"},{"$error":"#REF!"},{"$error":"#REF!"},{"$error":"#REF!"},{"$error":"#REF!"},null,null,null,null,null,null,null,null,null,null,null,null,null,null,null,null,null,"2011-07-01",5.0000000000000001E-3,"2011-07-01",5.0000000000000001E-3,null,"2011-07-01",9.7000000000000003E-3,"2011-07-01","2011-07-01",9.7000000000000003E-3,null,"2011-07-01","2011-07-01","","","",9.7000000000000003E-3,9.7000000000000003E-3,0.82649999999999979,null,null,null,null,null,null,null,null,null,null,null,"",null,"2016-07-01",5.4000000000000003E-3,null,"2016-07-01",6.629105000000024E-3]
[null,"2015-08-01",788,"2015-08-01",788,null,"2016-08-01",4.4999999999999997E-3,"2016-08-01",4.4999999999999997E-3,null,"2016-08-01",4.4000000000000003E-3,"2016-08-01",4.4000000000000003E-3,null,"2016-08-01",2.545E-3,"2016-08-01",2.545E-3,null,null,null,"","",null,"2011-09-10",4.5469999999999998E-3,5.3559999999999997E-3,6.1580000000000003E-3,6.953E-3,"2011-08-01",4.5469999999999998E-3,5.3559999999999997E-3,6.1580000000000003E-3,6.953E-3,null,"2016-08-01",2.545E-3,null,"2016-08-01",2.4659999999999999E-3,3.2729999999999999E-3,4.0740000000000004E-3,4.8669999999999998E-3,null,196,{"$error":"#REF!"},{"$error":"#REF!"},{"$error":"#REF!"},{"$error":"#REF!"},{"$error":"#REF!"},null,null,null,null,null,null,null,null,null,null,null,null,null,null,null,null,null,"2011-08-01",5.0000000000000001E-3,"2011-08-01",5.0000000000000001E-3,null,"2011-08-01",1.0699999999999999E-2,"2011-08-01","2011-08-01",1.0699999999999999E-2,null,"2011-08-01","2011-08-01","","","",1.0699999999999999E-2,1.0699999999999999E-2,0.81579999999999975,null,null,null,null,null,null,null,null,null,null,null,"",null,"2016-08-01",4.4999999999999997E-3,null,"2016-08-01",7.5577249999998486E-3]
[null,"2015-09-01",788,"2015-09-01",788,null,"2016-09-01",2.3E-3,"2016-09-01",2.3E-3,null,"2016-09-01",8.0000000000000004E-4,"2016-09-01",8.0000000000000004E-4,null,"2016-09-01",1.575E-3,"2016-09-01",1.575E-3,null,null,null,"","",null,"2011-10-10",3.4710000000000001E-3,4.28E-3,5.0809999999999996E-3,5.875E-3,"2011-09-01",3.4710000000000001E-3,4.28E-3,5.0809999999999996E-3,5.875E-3,null,"2016-09-01",1.575E-3,null,"2016-09-01",2.4659999999999999E-3,3.2729999999999999E-3,4.0740000000000004E-3,4.8669999999999998E-3,null,197,{"$error":"#REF!"},{"$error":"#REF!"},{"$error":"#REF!"},{"$error":"#REF!"},{"$error":"#REF!"},null,null,null,null,null,null,null,null,null,null,null,null,null,null,null,null,null,"2011-09-01",5.0000000000000001E-3,{"$f":"+IF(AND(TRIM(BR197)=\"\",TRIM(BR196)<>\"\"),\"\",IF(TRIM(BR197)=\"\",\"\",TRUNC(BR197,0)))","v":"2011-09-01"},5.0000000000000001E-3,null,"2011-09-01",9.4000000000000004E-3,"2011-09-01","2011-09-01",9.4000000000000004E-3,null,"2011-09-01","2011-09-01","","","",9.4000000000000004E-3,9.4000000000000004E-3,0.80639999999999978,null,null,null,null,null,null,null,null,null,null,null,"",null,"2016-09-01",2.3E-3,null,"2016-09-01",6.5828750000000991E-3]
[null,"2015-10-01",788,"2015-10-01",788,null,"2016-10-01",1.9E-3,"2016-10-01",1.9E-3,null,"2016-10-01",2.5999999999999999E-3,"2016-10-01",2.5999999999999999E-3,null,"2016-10-01",1.601E-3,"2016-10-01",1.601E-3,null,null,null,"","",null,"2011-11-10",3.0869999999999999E-3,3.895E-3,4.6959999999999997E-3,5.4900000000000001E-3,"2011-10-01",3.0869999999999999E-3,3.895E-3,4.6959999999999997E-3,5.4900000000000001E-3,null,"2016-10-01",1.601E-3,null,"2016-10-01",2.4659999999999999E-3,3.2729999999999999E-3,4.0740000000000004E-3,4.8669999999999998E-3,null,198,{"$error":"#REF!"},{"$error":"#REF!"},{"$error":"#REF!"},{"$error":"#REF!"},{"$error":"#REF!"},null,null,null,null,null,null,null,null,null,null,null,null,null,null,null,null,null,"2011-10-01",5.0000000000000001E-3,"2011-10-01",{"$f":"IF(TRIM(BS198)=\"\",\"\",BS198)","v":5.0000000000000001E-3},null,"2011-10-01",8.8000000000000005E-3,"2011-10-01","2011-10-01",8.8000000000000005E-3,null,{"$f":"+IF(BT198=\"\",\"\",BT198)","v":"2011-10-01"},"2011-10-01","","","",8.8000000000000005E-3,8.8000000000000005E-3,0.79759999999999975,null,null,null,null,null,null,null,null,null,null,null,"",null,"2016-10-01",1.9E-3,null,"2016-10-01",6.6090049999998346E-3]
[null,"2015-11-01",788,"2015-11-01",788,null,"2016-11-01",2.5999999999999999E-3,"2016-11-01",2.5999999999999999E-3,null,"2016-11-01",1.8E-3,"2016-11-01",1.8E-3,null,"2016-11-01",1.428E-3,"2016-11-01",1.428E-3,null,null,null,"","",null,"2011-12-10",3.1120000000000002E-3,3.9199999999999999E-3,4.7210000000000004E-3,5.5149999999999999E-3,"2011-11-01",3.1120000000000002E-3,3.9199999999999999E-3,4.7210000000000004E-3,5.5149999999999999E-3,null,"2016-11-01",1.428E-3,null,"2016-11-01",2.4659999999999999E-3,3.2729999999999999E-3,4.0740000000000004E-3,4.8669999999999998E-3,null,199,{"$error":"#REF!"},{"$error":"#REF!"},{"$error":"#REF!"},{"$error":"#REF!"},{"$error":"#REF!"},null,null,null,null,null,null,null,null,null,null,null,null,null,null,null,null,null,"2011-11-01",5.0000000000000001E-3,"2011-11-01",5.0000000000000001E-3,null,"2011-11-01",8.6E-3,"2011-11-01","2011-11-01",8.6E-3,null,"2011-11-01","2011-11-01","","","",8.6E-3,8.6E-3,0.7889999999999997,null,null,null,null,null,null,null,null,null,null,null,"",null,"2016-11-01",2.5999999999999999E-3,null,"2016-11-01",6.4351399999997838E-3]
[null,"2015-12-01",788,"2015-12-01",788,null,"2016-12-01",1.9E-3,"2016-12-01",1.9E-3,null,"2016-12-01",3.0000000000000001E-3,"2016-12-01",3.0000000000000001E-3,null,"2016-12-01",1.8489999999999999E-3,"2016-12-01",1.8489999999999999E-3,null,null,null,"","",null,"2012-01-10",3.405E-3,4.2129999999999997E-3,5.0140000000000002E-3,5.8089999999999999E-3,"2011-12-01",3.405E-3,4.2129999999999997E-3,5.0140000000000002E-3,5.8089999999999999E-3,null,"2016-12-01",1.8489999999999999E-3,null,"2016-12-01",2.4659999999999999E-3,3.2729999999999999E-3,4.0740000000000004E-3,4.8669999999999998E-3,null,200,{"$error":"#REF!"},{"$error":"#REF!"},{"$error":"#REF!"},{"$error":"#REF!"},{"$error":"#REF!"},null,null,null,null,null,null,null,null,null,null,null,null,null,null,null,null,null,"2011-12-01",5.0000000000000001E-3,"2011-12-01",5.0000000000000001E-3,null,"2011-12-01",9.1000000000000004E-3,"2011-12-01","2011-12-01",9.1000000000000004E-3,null,"2011-12-01","2011-12-01","","","",9.1000000000000004E-3,9.1000000000000004E-3,0.7798999999999997,null,null,null,null,null,null,null,null,null,null,null,"",null,"2016-12-01",1.9E-3,null,"2016-12-01",6.858244999999874E-3]
[null,"2016-01-01",880,"2016-01-01",880,null,"2017-01-01",3.0999999999999999E-3,{"$f":"+IF(AND(TRIM(G201)=\"\",TRIM(G200)<>\"\"),EDATE(I200,1),IF(TRIM(G201)=\"\",\"\",TRUNC(G201,0)))","v":"2017-01-01"},{"$f":"+IF(AND(H201=\"\",H200<>\"\"),0,IF(TRIM(H201)=\"\",\"\",H201))","v":3.0999999999999999E-3},null,"2017-01-01",3.8E-3,"2017-01-01",3.8E-3,null,"2017-01-01",1.6999999999999999E-3,{"$f":"+IF(AND(TRIM(Q201)=\"\",TRIM(Q200)<>\"\"),EDATE(S200,1),IF(TRIM(Q201)=\"\",\"\",TRUNC(Q201,0)))","v":"2017-01-01"},{"$f":"+IF(AND(R201=\"\",R200<>\"\"),0,IF(TRIM(R201)=\"\",\"\",R201))","v":1.6999999999999999E-3},null,null,null,{"$f":"+IF(AND(TRIM(V201)=\"\",TRIM(V200)<>\"\"),EDATE(X200,1),IF(TRIM(V201)=\"\",\"\",TRUNC(V201,0)))","v":""},{"$f":"+IF(AND(W201=\"\",W200<>\"\"),0,IF(TRIM(W201)=\"\",\"\",W201))","v":""},null,"2012-02-10",3.3319999999999999E-3,4.1399999999999996E-3,4.9410000000000001E-3,5.7349999999999996E-3,"2012-01-01",3.3319999999999999E-3,4.1399999999999996E-3,4.9410000000000001E-3,5.7349999999999996E-3,null,"2017-01-01",1.6999999999999999E-3,null,"2017-01-01",2.4659999999999999E-3,3.2729999999999999E-3,4.0740000000000004E-3,4.8669999999999998E-3,null,201,{"$f":"IF(INDIRECT(CONCATENATE(VLET_DT,TEXT(AU201,\"#0\")))=\"\",\"\",INDIRECT(CONCATENATE(VLET_DT,TEXT(AU201,\"#0\"))))","v":{"$error":"#REF!"}},{"$f":"+IF(AV201=\"\",\"\",IF(AV201<=VDAT_AT,AV201,\"\"))","v":{"$error":"#REF!"}},{"$f":"IF(OR(AW201=\"\",INDIRECT(CONCATENATE(VLET_COT,TEXT(AU201,\"#0\")))=\"\"),\"\",IF(AW201=VDAT_AT,1+IF(COD_CM=4,0.01,0),INDIRECT(CONCATENATE(VLET_COT,TEXT(AU201,\"#0\")))))","v":{"$error":"#REF!"}},{"$f":"+IF(COD_CM=4,IF(AX201=\"\",\"\",AX201+IF(AY202=\"\",0,AY202)),IF(OR(AV201>VDAT_AT,AV201=\"\"),\"\",IF(AV201=VDAT_AT,1,IF(AY202=\"\",1,AY202)*(1+AX201)/AZ201)))","v":{"$error":"#REF!"}},{"$f":"+IF(AW201=\"\",\"\",LOOKUP(AW201,COL_DAT_CORTE,COL_VAL_CORTE))","v":{"$error":"#REF!"}},null,null,null,null,null,null,null,null,null,null,null,null,null,null,null,null,null,"2012-01-01",5.0000000000000001E-3,"2012-01-01",5.0000000000000001E-3,null,"2012-01-01",8.8999999999999999E-3,{"$f":"+IF(AND(TRIM(BW201)=\"\",TRIM(BW200)<>\"\"),EDATE(BY200,1),IF(TRIM(BW201)=\"\",\"\",TRUNC(BW201,0)))","v":"2012-01-01"},{"$f":"+IF(BY201=\"\",\"\",IF(BY201<=VDAT_AT,BY201,\"\"))","v":"2012-01-01"},{"$f":"+IF(BY201>VDAT_AT,\"\",IF(AND(BZ201<>\"\",BZ202=\"\"),0.01,IF(TRIM(BX201)=\"\",\"\",BX201)))","v":8.8999999999999999E-3},null,"2012-01-01","2012-01-01",{"$f":"+IF(CC201=\"\",\"\",IF(COD_JUROS=1,0.5%,IF(COD_JUROS=4,1%,IF(COD_JUROS=11,0%,\"\"))))","v":""},{"$f":"+IF(OR(COD_JUROS<>2,CD201=\"\"),\"\",BU201)","v":""},"",{"$f":"+IF(OR(COD_JUROS<>10,CD201=\"\"),\"\",CA201)","v":8.8999999999999999E-3},8.8999999999999999E-3,{"$f":"+IF(CI201=\"\",\"\",IF(CD201=VDAT_AT1,0,CI202+IF(CJ202=\"\",0,CJ202)))","v":0.77099999999999969},null,null,null,null,null,null,null,null,null,null,null,"",null,"2017-01-01",3.0999999999999999E-3,null,{"$f":"+S201","v":"2017-01-01"},{"$f":"+IF(OR(T201=\"\",BU261=\"\"),\"\",((1+T201)*(1+BU261)-1))","v":6.7085000000000061E-3}]
[null,"2016-02-01",880,{"$f":"+IF(TRIM(B202)=\"\",\"\",B202)","v":"2016-02-01"},880,null,"2017-02-01",5.4000000000000003E-3,"2017-02-01",5.4000000000000003E-3,null,"2017-02-01",3.3E-3,"2017-02-01",{"$f":"+IF(TRIM(M202)=\"\",\"\",M202)","v":3.3E-3},null,"2017-02-01",3.0200000000000002E-4,"2017-02-01",3.0200000000000002E-4,null,null,null,"","",null,"2012-03-10",2.4659999999999999E-3,3.2729999999999999E-3,4.0740000000000004E-3,4.8669999999999998E-3,"2012-02-01",2.4659999999999999E-3,3.2729999999999999E-3,4.0740000000000004E-3,4.8669999999999998E-3,null,"2017-02-01",3.0200000000000002E-4,null,"2017-02-01",2.4659999999999999E-3,3.2729999999999999E-3,4.0740000000000004E-3,4.8669999999999998E-3,null,202,{"$error":"#REF!"},{"$error":"#REF!"},{"$error":"#REF!"},{"$error":"#REF!"},{"$error":"#REF!"},null,null,null,null,null,null,null,null,null,null,null,null,null,null,null,null,null,"2012-02-01",5.0000000000000001E-3,"2012-02-01",5.0000000000000001E-3,null,"2012-02-01",7.4999999999999997E-3,"2012-02-01","2012-02-01",7.4999999999999997E-3,null,"2012-02-01",{"$f":"+IF(CD201=\"\",\"\",IF(EDATE(CD201,1)<=VDAT_AT1,EDATE(CD201,1),\"\"))","v":"2012-02-01"},"","","",7.4999999999999997E-3,{"$f":"+IF(CD202=\"\",\"\",SUM(CE202:CH202))","v":7.4999999999999997E-3},0.76349999999999973,null,null,null,null,null,null,null,null,null,null,null,{"$f":"+IF(CU202=\"\",\"\",TRIM(CU202))","v":""},null,"2017-02-01",5.4000000000000003E-3,null,"2017-02-01",5.3035099999998447E-3]
[null,"2016-03-01",880,"2016-03-01",880,null,"2017-03-01",1.5E-3,"2017-03-01",1.5E-3,null,"2017-03-01",2.5000000000000001E-3,"2017-03-01",2.5000000000000001E-3,null,"2017-03-01",1.519E-3,"2017-03-01",1.519E-3,null,null,null,"","",null,"2012-04-10",3.5360000000000001E-3,4.3449999999999999E-3,5.1460000000000004E-3,5.94E-3,"2012-03-01",3.5360000000000001E-3,4.3449999999999999E-3,5.1460000000000004E-3,5.94E-3,null,"2017-03-01",1.519E-3,null,"2017-03-01",2.4659999999999999E-3,3.2729999999999999E-3,4.0740000000000004E-3,4.8669999999999998E-3,null,203,{"$error":"#REF!"},{"$error":"#REF!"},{"$error":"#REF!"},{"$error":"#REF!"},{"$error":"#REF!"},null,null,null,null,null,null,null,null,null,null,null,null,null,null,null,null,null,"2012-03-01",5.0000000000000001E-3,"2012-03-01",5.0000000000000001E-3,null,"2012-03-01",8.2000000000000007E-3,"2012-03-01","2012-03-01",8.2000000000000007E-3,null,"2012-03-01","2012-03-01","","",{"$f":"+IF(OR(COD_JUROS<>3,CD202=\"\"),\"\",BU203)","v":""},8.2000000000000007E-3,8.2000000000000007E-3,0.75529999999999975,null,null,null,null,null,null,null,null,null,null,null,"",null,"2017-03-01",1.5E-3,null,"2017-03-01",6.5265949999999684E-3]
[null,"2016-04-01",880,"2016-04-01",880,null,"2017-04-01",2.0999999999999999E-3,"2017-04-01",2.0999999999999999E-3,null,"2017-04-01",1.4E-3,"2017-04-01",1.4E-3,null,"2017-04-01",0,"2017-04-01",0,null,null,null,"","",null,"2012-05-10",2.6930000000000001E-3,3.5010000000000002E-3,4.3020000000000003E-3,5.0949999999999997E-3,"2012-04-01",2.6930000000000001E-3,3.5010000000000002E-3,4.3020000000000003E-3,5.0949999999999997E-3,null,"2017-04-01",0,null,"2017-04-01",2.4659999999999999E-3,3.2729999999999999E-3,4.0740000000000004E-3,4.8669999999999998E-3,null,204,{"$error":"#REF!"},{"$error":"#REF!"},{"$error":"#REF!"},{"$error":"#REF!"},{"$error":"#REF!"},null,null,null,null,null,null,null,null,null,null,null,null,null,null,null,null,null,"2012-04-01",5.0000000000000001E-3,"2012-04-01",5.0000000000000001E-3,null,"2012-04-01",7.1000000000000004E-3,"2012-04-01","2012-04-01",7.1000000000000004E-3,null,"2012-04-01","2012-04-01","","","",7.1000000000000004E-3,7.1000000000000004E-3,0.74819999999999975,null,null,null,null,null,null,null,null,null,null,null,"",null,"2017-04-01",2.0999999999999999E-3,null,"2017-04-01",4.9999999999998934E-3]
[null,"2016-05-01",880,"2016-05-01",880,null,"2017-05-01",2.3999999999999998E-3,"2017-05-01",2.3999999999999998E-3,null,"2017-05-01",3.0999999999999999E-3,"2017-05-01",3.0999999999999999E-3,null,"2017-05-01",7.6400000000000003E-4,"2017-05-01",7.6400000000000003E-4,null,null,null,"","",null,"2012-06-10",2.9350000000000001E-3,3.7429999999999998E-3,4.5440000000000003E-3,5.3369999999999997E-3,"2012-05-01",2.9350000000000001E-3,3.7429999999999998E-3,4.5440000000000003E-3,5.3369999999999997E-3,null,"2017-05-01",7.6400000000000003E-4,null,"2017-05-01",2.4659999999999999E-3,3.2729999999999999E-3,4.0740000000000004E-3,4.8669999999999998E-3,null,205,{"$error":"#REF!"},{"$error":"#REF!"},{"$error":"#REF!"},{"$error":"#REF!"},{"$error":"#REF!"},null,null,null,null,null,null,null,null,null,null,null,null,null,null,null,null,null,"2012-05-01",5.0000000000000001E-3,"2012-05-01",5.0000000000000001E-3,null,"2012-05-01",7.4000000000000003E-3,"2012-05-01","2012-05-01",7.4000000000000003E-3,null,"2012-05-01","2012-05-01","","","",7.4000000000000003E-3,7.4000000000000003E-3,0.74079999999999979,null,null,null,null,null,null,null,null,null,null,null,"",null,"2017-05-01",2.3999999999999998E-3,null,"2017-05-01",5.7678199999999791E-3]
[null,"2016-06-01",880,"2016-06-01",880,null,"2017-06-01",1.6000000000000001E-3,"2017-06-01",1.6000000000000001E-3,null,"2017-06-01",-2.3E-3,"2017-06-01",-2.3E-3,null,"2017-06-01",5.3600000000000002E-4,"2017-06-01",5.3600000000000002E-4,null,null,null,"","",null,"2012-07-10",2.4659999999999999E-3,3.2729999999999999E-3,4.0740000000000004E-3,4.8669999999999998E-3,"2012-06-01",2.4659999999999999E-3,3.2729999999999999E-3,4.0740000000000004E-3,4.8669999999999998E-3,null,"2017-06-01",5.3600000000000002E-4,null,"2017-06-01",2.4659999999999999E-3,3.2729999999999999E-3,4.0740000000000004E-3,4.8669999999999998E-3,null,206,{"$error":"#REF!"},{"$error":"#REF!"},{"$error":"#REF!"},{"$error":"#REF!"},{"$error":"#REF!"},null,null,null,null,null,null,null,null,null,null,null,null,null,null,null,null,null,"2012-06-01",5.0000000000000001E-3,"2012-06-01",5.0000000000000001E-3,null,"2012-06-01",6.4000000000000003E-3,"2012-06-01","2012-06-01",6.4000000000000003E-3,null,"2012-06-01","2012-06-01","","","",6.4000000000000003E-3,6.4000000000000003E-3,0.73439999999999983,null,null,null,null,null,null,null,null,null,null,null,"",null,"2017-06-01",1.6000000000000001E-3,null,"2017-06-01",5.538679999999907E-3]
[null,"2016-07-01",880,"2016-07-01",880,null,"2017-07-01",-1.8E-3,"2017-07-01",-1.8E-3,null,"2017-07-01",2.3999999999999998E-3,"2017-07-01",2.3999999999999998E-3,null,"2017-07-01",6.2299999999999996E-4,"2017-07-01",6.2299999999999996E-4,null,null,null,"","",null,"2012-08-10",2.6099999999999999E-3,3.418E-3,4.2180000000000004E-3,5.012E-3,"2012-07-01",2.6099999999999999E-3,3.418E-3,4.2180000000000004E-3,5.012E-3,null,{"$f":"+S207","v":"2017-07-01"},{"$f":"+T207","v":6.2299999999999996E-4},null,"2017-07-01",2.4659999999999999E-3,3.2729999999999999E-3,4.0740000000000004E-3,4.8669999999999998E-3,null,207,{"$error":"#REF!"},{"$error":"#REF!"},{"$error":"#REF!"},{"$error":"#REF!"},{"$error":"#REF!"},null,null,null,null,null,null,null,null,null,null,null,null,null,null,null,null,null,"2012-07-01",4.8279999999999998E-3,"2012-07-01",4.8279999999999998E-3,null,"2012-07-01",6.7999999999999996E-3,"2012-07-01","2012-07-01",6.7999999999999996E-3,null,"2012-07-01","2012-07-01","","","",6.7999999999999996E-3,6.7999999999999996E-3,0.7275999999999998,null,null,null,null,null,null,null,null,null,null,null,"",null,"2017-07-01",-1.8E-3,null,"2017-07-01",5.6261149999998761E-3]
[null,"2016-08-01",880,"2016-08-01",880,null,"2017-08-01",3.5000000000000001E-3,"2017-08-01",3.5000000000000001E-3,null,"2017-08-01",1.9E-3,"2017-08-01",1.9E-3,null,"2017-08-01",5.0900000000000001E-4,"2017-08-01",5.0900000000000001E-4,null,null,null,"","",null,"2012-09-10",2.5890000000000002E-3,3.3969999999999998E-3,4.1970000000000002E-3,4.9909999999999998E-3,"2012-08-01",2.5890000000000002E-3,3.3969999999999998E-3,4.1970000000000002E-3,4.9909999999999998E-3,null,"2017-08-01",5.0900000000000001E-4,null,"2017-08-01",2.4659999999999999E-3,3.2729999999999999E-3,4.0740000000000004E-3,4.8669999999999998E-3,null,208,{"$error":"#REF!"},{"$error":"#REF!"},{"$error":"#REF!"},{"$error":"#REF!"},{"$error":"#REF!"},null,null,null,null,null,null,null,null,null,null,null,null,null,null,null,null,null,"2012-08-01",4.8279999999999998E-3,"2012-08-01",4.8279999999999998E-3,null,"2012-08-01",6.8999999999999999E-3,"2012-08-01","2012-08-01",6.8999999999999999E-3,null,"2012-08-01","2012-08-01","","","",6.8999999999999999E-3,6.8999999999999999E-3,0.72069999999999979,null,null,null,null,null,null,null,null,null,null,null,"",null,"2017-08-01",3.5000000000000001E-3,null,"2017-08-01",5.5115450000000621E-3]
[null,"2016-09-01",880,"2016-09-01",880,null,"2017-09-01",1.1000000000000001E-3,"2017-09-01",1.1000000000000001E-3,null,"2017-09-01",1.6000000000000001E-3,"2017-09-01",1.6000000000000001E-3,null,"2017-09-01",0,"2017-09-01",0,null,null,null,"","",null,"2012-10-10",2.4659999999999999E-3,3.2729999999999999E-3,4.0740000000000004E-3,4.8669999999999998E-3,"2012-09-01",2.4659999999999999E-3,3.2729999999999999E-3,4.0740000000000004E-3,4.8669999999999998E-3,null,"2017-09-01",0,null,"2017-09-01",2.4659999999999999E-3,3.2729999999999999E-3,4.0740000000000004E-3,4.8669999999999998E-3,null,209,{"$error":"#REF!"},{"$error":"#REF!"},{"$error":"#REF!"},{"$error":"#REF!"},{"$error":"#REF!"},null,null,null,null,null,null,null,null,null,null,null,null,null,null,null,null,null,"2012-09-01",4.5510000000000004E-3,"2012-09-01",4.5510000000000004E-3,null,"2012-09-01",5.4000000000000003E-3,"2012-09-01","2012-09-01",5.4000000000000003E-3,null,"2012-09-01","2012-09-01","","","",5.4000000000000003E-3,5.4000000000000003E-3,0.71529999999999982,null,null,null,null,null,null,null,null,null,null,null,null,null,"2017-09-01",1.1000000000000001E-3,null,"2017-09-01",4.9999999999998934E-3]
[null,"2016-10-01",880,"2016-10-01",880,null,"2017-10-01",3.3999999999999998E-3,"2017-10-01",3.3999999999999998E-3,null,"2017-10-01",4.1999999999999997E-3,"2017-10-01",4.1999999999999997E-3,null,"2017-10-01",0,"2017-10-01",0,null,null,null,"","",null,"2012-11-10",2.4659999999999999E-3,3.2729999999999999E-3,4.0740000000000004E-3,4.8669999999999998E-3,"2012-10-01",2.4659999999999999E-3,3.2729999999999999E-3,4.0740000000000004E-3,4.8669999999999998E-3,null,"2017-10-01",0,null,"2017-10-01",2.4659999999999999E-3,3.2729999999999999E-3,4.0740000000000004E-3,4.8669999999999998E-3,null,210,{"$error":"#REF!"},{"$error":"#REF!"},{"$error":"#REF!"},{"$error":"#REF!"},{"$error":"#REF!"},null,null,null,null,null,null,null,null,null,null,null,null,null,null,null,null,null,"2012-10-01",4.2729999999999999E-3,"2012-10-01",4.2729999999999999E-3,null,"2012-10-01",6.1000000000000004E-3,"2012-10-01","2012-10-01",6.1000000000000004E-3,null,"2012-10-01","2012-10-01","","","",6.1000000000000004E-3,6.1000000000000004E-3,0.70919999999999983,null,null,null,null,null,null,null,null,null,null,null,null,null,"2017-10-01",3.3999999999999998E-3,null,"2017-10-01",4.9999999999998934E-3]
[null,"2016-11-01",880,"2016-11-01",880,null,"2017-11-01",3.2000000000000002E-3,"2017-11-01",3.2000000000000002E-3,null,"2017-11-01",2.8E-3,"2017-11-01",2.8E-3,null,"2017-11-01",0,"2017-11-01",0,null,null,null,"","",null,"2012-12-10",2.4659999999999999E-3,3.2729999999999999E-3,4.0740000000000004E-3,4.8669999999999998E-3,"2012-11-01",2.4659999999999999E-3,3.2729999999999999E-3,4.0740000000000004E-3,4.8669999999999998E-3,null,"2017-11-01",0,null,"2017-11-01",2.4659999999999999E-3,3.2729999999999999E-3,4.0740000000000004E-3,4.8669999999999998E-3,null,211,{"$error":"#REF!"},{"$error":"#REF!"},{"$error":"#REF!"},{"$error":"#REF!"},{"$error":"#REF!"},null,null,null,null,null,null,null,null,null,null,null,null,null,null,null,null,null,"2012-11-01",4.2729999999999999E-3,"2012-11-01",4.2729999999999999E-3,null,"2012-11-01",5.4999999999999997E-3,"2012-11-01","2012-11-01",5.4999999999999997E-3,null,"2012-11-01","2012-11-01","","","",5.4999999999999997E-3,5.4999999999999997E-3,0.70369999999999988,null,null,null,null,null,null,null,null,null,null,null,null,null,"2017-11-01",3.2000000000000002E-3,null,"2017-11-01",4.690000000000083E-3]
[null,"2016-12-01",880,"2016-12-01",880,null,"2017-12-01",3.5000000000000001E-3,"2017-12-01",3.5000000000000001E-3,null,"2017-12-01",4.4000000000000003E-3,"2017-12-01",4.4000000000000003E-3,null,"2017-12-01",0,"2017-12-01",0,null,null,null,"","",null,"2013-01-10",2.4659999999999999E-3,3.2729999999999999E-3,4.0740000000000004E-3,4.8669999999999998E-3,"2012-12-01",2.4659999999999999E-3,3.2729999999999999E-3,4.0740000000000004E-3,4.8669999999999998E-3,null,"2017-12-01",0,null,"2017-12-01",2.4659999999999999E-3,3.2729999999999999E-3,4.0740000000000004E-3,4.8669999999999998E-3,null,212,{"$error":"#REF!"},{"$error":"#REF!"},{"$error":"#REF!"},{"$error":"#REF!"},{"$error":"#REF!"},null,null,null,null,null,null,null,null,null,null,null,null,null,null,null,null,null,"2012-12-01",4.1339999999999997E-3,"2012-12-01",4.1339999999999997E-3,null,"2012-12-01",5.4999999999999997E-3,"2012-12-01","2012-12-01",5.4999999999999997E-3,null,"2012-12-01","2012-12-01","","","",5.4999999999999997E-3,5.4999999999999997E-3,0.69819999999999993,null,null,null,null,null,null,null,null,null,null,null,null,null,{"$f":"+I212","v":"2017-12-01"},{"$f":"+J212","v":3.5000000000000001E-3},null,"2017-12-01",4.2729999999999713E-3]
[null,"2017-01-01",937,"2017-01-01",937,null,"2018-01-01",3.8999999999999998E-3,"2018-01-01",3.8999999999999998E-3,null,"2018-01-01",2.8999999999999998E-3,"2018-01-01",2.8999999999999998E-3,null,"2018-01-01",0,"2018-01-01",0,null,null,null,"","",null,"2013-02-10",2.4659999999999999E-3,3.2729999999999999E-3,4.0740000000000004E-3,4.8669999999999998E-3,"2013-01-01",2.4659999999999999E-3,3.2729999999999999E-3,4.0740000000000004E-3,4.8669999999999998E-3,null,"2018-01-01",0,null,{"$f":"IF(AO212=\"\",\"\",IF(EDATE(AO212,1)>VMES99,\"\",EDATE(AO212,1)))","v":"2018-01-01"},{"$f":"+IF(DB213=\"\",\"\",0.002466)","v":2.4659999999999999E-3},{"$f":"+IF(DB213=\"\",\"\",0.003273)","v":3.2729999999999999E-3},{"$f":"+IF(DB213=\"\",\"\",0.004074)","v":4.0740000000000004E-3},{"$f":"+IF(DB213=\"\",\"\",0.004867)","v":4.8669999999999998E-3},null,213,{"$error":"#REF!"},{"$error":"#REF!"},{"$error":"#REF!"},{"$error":"#REF!"},{"$error":"#REF!"},null,null,null,null,null,null,null,null,null,null,null,null,null,null,null,null,null,"2013-01-01",4.1339999999999997E-3,"2013-01-01",4.1339999999999997E-3,null,"2013-01-01",6.0000000000000001E-3,"2013-01-01","2013-01-01",6.0000000000000001E-3,null,"2013-01-01","2013-01-01","","","",6.0000000000000001E-3,6.0000000000000001E-3,0.69219999999999993,null,null,null,null,null,null,null,null,null,null,null,null,null,"2018-01-01",3.8999999999999998E-3,null,"2018-01-01",4.2729999999999713E-3]
[null,"2017-02-01",937,"2017-02-01",937,null,"2018-02-01",3.8E-3,"2018-02-01",3.8E-3,null,"2018-02-01",3.2000000000000002E-3,"2018-02-01",3.2000000000000002E-3,null,"2018-02-01",0,"2018-02-01",0,null,null,null,"","",null,"2013-03-10",2.4659999999999999E-3,3.2729999999999999E-3,4.0740000000000004E-3,4.8669999999999998E-3,"2013-02-01",2.4659999999999999E-3,3.2729999999999999E-3,4.0740000000000004E-3,4.8669999999999998E-3,null,"2018-02-01",0,null,"2018-02-01",2.4659999999999999E-3,3.2729999999999999E-3,4.0740000000000004E-3,4.8669999999999998E-3,null,214,{"$error":"#REF!"},{"$error":"#REF!"},{"$error":"#REF!"},{"$error":"#REF!"},{"$error":"#REF!"},null,null,null,null,null,null,null,null,null,null,null,null,null,null,null,null,null,"2013-02-01",4.1339999999999997E-3,"2013-02-01",4.1339999999999997E-3,null,"2013-02-01",4.8999999999999998E-3,"2013-02-01","2013-02-01",4.8999999999999998E-3,null,"2013-02-01","2013-02-01","","","",4.8999999999999998E-3,4.8999999999999998E-3,0.68729999999999991,null,null,null,null,null,null,null,null,null,null,null,null,null,"2018-02-01",3.8E-3,null,"2018-02-01",3.9940000000000531E-3]
[null,"2017-03-01",937,"2017-03-01",937,null,"2018-03-01",1E-3,"2018-03-01",1E-3,null,"2018-03-01",8.9999999999999998E-4,"2018-03-01",8.9999999999999998E-4,null,"2018-03-01",0,"2018-03-01",0,null,null,null,"","",null,"2013-04-10",2.4659999999999999E-3,3.2729999999999999E-3,4.0740000000000004E-3,4.8669999999999998E-3,"2013-03-01",2.4659999999999999E-3,3.2729999999999999E-3,4.0740000000000004E-3,4.8669999999999998E-3,null,"2018-03-01",0,null,"2018-03-01",2.4659999999999999E-3,3.2729999999999999E-3,4.0740000000000004E-3,4.8669999999999998E-3,null,215,{"$error":"#REF!"},{"$error":"#REF!"},{"$error":"#REF!"},{"$error":"#REF!"},{"$error":"#REF!"},null,null,null,null,null,null,null,null,null,null,null,null,null,null,null,null,null,"2013-03-01",4.1339999999999997E-3,"2013-03-01",4.1339999999999997E-3,null,"2013-03-01",5.4999999999999997E-3,"2013-03-01","2013-03-01",5.4999999999999997E-3,null,"2013-03-01","2013-03-01","","","",5.4999999999999997E-3,5.4999999999999997E-3,0.68179999999999996,null,null,null,null,null,null,null,null,null,null,null,null,null,"2018-03-01",1E-3,null,"2018-03-01",3.9940000000000531E-3]
[null,"2017-04-01",937,"2017-04-01",937,null,"2018-04-01",2.0999999999999999E-3,"2018-04-01",2.0999999999999999E-3,null,"2018-04-01",2.2000000000000001E-3,"2018-04-01",2.2000000000000001E-3,null,"2018-04-01",0,"2018-04-01",0,null,null,null,"","",null,"2013-05-10",2.4659999999999999E-3,3.2729999999999999E-3,4.0740000000000004E-3,4.8669999999999998E-3,"2013-04-01",2.4659999999999999E-3,3.2729999999999999E-3,4.0740000000000004E-3,4.8669999999999998E-3,null,"2018-04-01",0,null,"2018-04-01",2.4659999999999999E-3,3.2729999999999999E-3,4.0740000000000004E-3,4.8669999999999998E-3,null,216,{"$error":"#REF!"},{"$error":"#REF!"},{"$error":"#REF!"},{"$error":"#REF!"},{"$error":"#REF!"},null,null,null,null,null,null,null,null,null,null,null,null,null,null,null,null,null,"2013-04-01",4.1339999999999997E-3,"2013-04-01",4.1339999999999997E-3,null,"2013-04-01",6.1000000000000004E-3,"2013-04-01","2013-04-01",6.1000000000000004E-3,null,"2013-04-01","2013-04-01","","","",6.1000000000000004E-3,6.1000000000000004E-3,0.67569999999999997,null,null,null,null,null,null,null,null,null,null,null,null,null,"2018-04-01",2.0999999999999999E-3,null,"2018-04-01",3.8549999999999418E-3]
[null,"2017-05-01",937,"2017-05-01",937,null,"2018-05-01",1.4E-3,"2018-05-01",1.4E-3,null,"2018-05-01",4.0000000000000001E-3,"2018-05-01",4.0000000000000001E-3,null,"2018-05-01",0,"2018-05-01",0,null,null,null,"","",null,"2013-06-10",2.4659999999999999E-3,3.2729999999999999E-3,4.0740000000000004E-3,4.8669999999999998E-3,"2013-05-01",2.4659999999999999E-3,3.2729999999999999E-3,4.0740000000000004E-3,4.8669999999999998E-3,null,"2018-05-01",0,null,"2018-05-01",2.4659999999999999E-3,3.2729999999999999E-3,4.0740000000000004E-3,4.8669999999999998E-3,null,217,{"$error":"#REF!"},{"$error":"#REF!"},{"$error":"#REF!"},{"$error":"#REF!"},{"$error":"#REF!"},null,null,null,null,null,null,null,null,null,null,null,null,null,null,null,null,null,"2013-05-01",4.1339999999999997E-3,"2013-05-01",4.1339999999999997E-3,null,"2013-05-01",6.0000000000000001E-3,"2013-05-01","2013-05-01",6.0000000000000001E-3,null,"2013-05-01","2013-05-01","","","",6.0000000000000001E-3,6.0000000000000001E-3,0.66969999999999996,null,null,null,null,null,null,null,null,null,null,null,null,null,"2018-05-01",1.4E-3,null,"2018-05-01",3.7149999999999128E-3]
[null,"2017-06-01",937,"2017-06-01",937,null,"2018-06-01",1.11E-2,"2018-06-01",1.11E-2,null,"2018-06-01",1.26E-2,"2018-06-01",1.26E-2,null,"2018-06-01",0,"2018-06-01",0,null,null,null,"","",null,"2013-07-10",2.4659999999999999E-3,3.2729999999999999E-3,4.0740000000000004E-3,4.8669999999999998E-3,"2013-06-01",2.4659999999999999E-3,3.2729999999999999E-3,4.0740000000000004E-3,4.8669999999999998E-3,null,"2018-06-01",0,null,"2018-06-01",2.4659999999999999E-3,3.2729999999999999E-3,4.0740000000000004E-3,4.8669999999999998E-3,null,218,{"$error":"#REF!"},{"$error":"#REF!"},{"$error":"#REF!"},{"$error":"#REF!"},{"$error":"#REF!"},null,null,null,null,null,null,null,null,null,null,null,null,null,null,null,null,null,"2013-06-01",4.2729999999999999E-3,"2013-06-01",4.2729999999999999E-3,null,"2013-06-01",6.1000000000000004E-3,"2013-06-01","2013-06-01",6.1000000000000004E-3,null,"2013-06-01","2013-06-01","","","",6.1000000000000004E-3,6.1000000000000004E-3,0.66359999999999997,null,null,null,null,null,null,null,null,null,null,null,null,null,"2018-06-01",1.11E-2,null,"2018-06-01",3.7149999999999128E-3]
[null,"2017-07-01",937,"2017-07-01",937,null,"2018-07-01",6.4000000000000003E-3,"2018-07-01",6.4000000000000003E-3,null,"2018-07-01",3.3E-3,"2018-07-01",{"$f":"+IF(AND(M219=\"\",M218<>\"\"),0,IF(TRIM(M219)=\"\",\"\",M219))","v":3.3E-3},null,"2018-07-01",0,"2018-07-01",0,null,null,null,"","",null,"2013-08-10",2.6749999999999999E-3,3.483E-3,4.2830000000000003E-3,5.0769999999999999E-3,"2013-07-01",2.6749999999999999E-3,3.483E-3,4.2830000000000003E-3,5.0769999999999999E-3,null,"2018-07-01",0,null,"2018-07-01",2.4659999999999999E-3,3.2729999999999999E-3,4.0740000000000004E-3,4.8669999999999998E-3,null,219,{"$error":"#REF!"},{"$error":"#REF!"},{"$error":"#REF!"},{"$error":"#REF!"},{"$error":"#REF!"},null,null,null,null,null,null,null,null,null,null,null,null,null,null,null,null,null,"2013-07-01",4.5510000000000004E-3,"2013-07-01",4.5510000000000004E-3,null,"2013-07-01",7.1999999999999998E-3,"2013-07-01","2013-07-01",7.1999999999999998E-3,null,"2013-07-01","2013-07-01","","","",7.1999999999999998E-3,7.1999999999999998E-3,0.65639999999999998,null,null,null,null,null,null,null,null,null,null,null,null,null,"2018-07-01",6.4000000000000003E-3,null,"2018-07-01",3.7149999999999128E-3]
[null,"2017-08-01",937,"2017-08-01",937,null,"2018-08-01",1.2999999999999999E-3,"2018-08-01",1.2999999999999999E-3,null,"2018-08-01",-8.9999999999999998E-4,"2018-08-01",-8.9999999999999998E-4,null,"2018-08-01",0,"2018-08-01",0,null,null,null,"","",null,"2013-09-10",2.4659999999999999E-3,3.2729999999999999E-3,4.0740000000000004E-3,4.8669999999999998E-3,"2013-08-01",2.4659999999999999E-3,3.2729999999999999E-3,4.0740000000000004E-3,4.8669999999999998E-3,null,"2018-08-01",0,null,"2018-08-01",2.4659999999999999E-3,3.2729999999999999E-3,4.0740000000000004E-3,4.8669999999999998E-3,null,220,{"$error":"#REF!"},{"$error":"#REF!"},{"$error":"#REF!"},{"$error":"#REF!"},{"$error":"#REF!"},null,null,null,null,null,null,null,null,null,null,null,null,null,null,null,null,null,"2013-08-01",4.5510000000000004E-3,"2013-08-01",4.5510000000000004E-3,null,"2013-08-01",7.1000000000000004E-3,"2013-08-01","2013-08-01",7.1000000000000004E-3,null,"2013-08-01","2013-08-01","","","",7.1000000000000004E-3,7.1000000000000004E-3,0.64929999999999999,null,null,null,null,null,null,null,null,null,null,null,null,null,"2018-08-01",1.2999999999999999E-3,null,"2018-08-01",3.7149999999999128E-3]
[null,"2017-09-01",937,"2017-09-01",937,null,"2018-09-01",8.9999999999999998E-4,"2018-09-01",8.9999999999999998E-4,null,"2018-09-01",4.7999999999999996E-3,"2018-09-01",4.7999999999999996E-3,null,"2018-09-01",0,"2018-09-01",0,null,null,null,"","",null,"2013-10-10",2.545E-3,3.3519999999999999E-3,4.1529999999999996E-3,4.9459999999999999E-3,"2013-09-01",2.545E-3,3.3519999999999999E-3,4.1529999999999996E-3,4.9459999999999999E-3,null,"2018-09-01",0,null,"2018-09-01",2.4659999999999999E-3,3.2729999999999999E-3,4.0740000000000004E-3,4.8669999999999998E-3,null,221,{"$error":"#REF!"},{"$error":"#REF!"},{"$error":"#REF!"},{"$error":"#REF!"},{"$error":"#REF!"},null,null,null,null,null,null,null,null,null,null,null,null,null,null,null,null,null,"2013-09-01",4.8279999999999998E-3,"2013-09-01",4.8279999999999998E-3,null,"2013-09-01",7.1000000000000004E-3,"2013-09-01","2013-09-01",7.1000000000000004E-3,null,"2013-09-01","2013-09-01","","","",7.1000000000000004E-3,7.1000000000000004E-3,0.64219999999999999,null,null,null,null,null,null,null,null,null,null,null,null,null,"2018-09-01",8.9999999999999998E-4,null,"2018-09-01",3.7149999999999128E-3]
[null,"2017-10-01",937,"2017-10-01",937,null,"2018-10-01",5.7999999999999996E-3,"2018-10-01",5.7999999999999996E-3,null,"2018-10-01",4.4999999999999997E-3,"2018-10-01",{"$f":"+IF(AND(M222=\"\",M221<>\"\"),0,IF(TRIM(M222)=\"\",\"\",M222))","v":4.4999999999999997E-3},null,"2018-10-01",0,"2018-10-01",0,null,null,null,"","",null,"2013-11-10",3.388E-3,4.1960000000000001E-3,4.9969999999999997E-3,5.7920000000000003E-3,"2013-10-01",3.388E-3,4.1960000000000001E-3,4.9969999999999997E-3,5.7920000000000003E-3,null,"2018-10-01",0,null,"2018-10-01",2.4659999999999999E-3,3.2729999999999999E-3,4.0740000000000004E-3,4.8669999999999998E-3,null,222,{"$error":"#REF!"},{"$error":"#REF!"},{"$error":"#REF!"},{"$error":"#REF!"},{"$error":"#REF!"},null,null,null,null,null,null,null,null,null,null,null,null,null,null,null,null,null,"2013-10-01",5.0000000000000001E-3,"2013-10-01",5.0000000000000001E-3,null,"2013-10-01",8.0999999999999996E-3,"2013-10-01","2013-10-01",8.0999999999999996E-3,null,"2013-10-01","2013-10-01","","","",8.0999999999999996E-3,8.0999999999999996E-3,0.6341,null,null,null,null,null,null,null,null,null,null,null,null,null,"2018-10-01",5.7999999999999996E-3,null,"2018-10-01",3.7149999999999128E-3]
[null,"2017-11-01",937,"2017-11-01",937,null,"2018-11-01",1.9E-3,"2018-11-01",1.9E-3,null,"2018-11-01",-2.0999999999999999E-3,"2018-11-01",-2.0999999999999999E-3,null,"2018-11-01",0,"2018-11-01",0,null,null,null,"","",null,"2013-12-10",2.673E-3,3.4810000000000002E-3,4.2810000000000001E-3,5.0749999999999997E-3,"2013-11-01",2.673E-3,3.4810000000000002E-3,4.2810000000000001E-3,5.0749999999999997E-3,null,"2018-11-01",0,null,"2018-11-01",2.4659999999999999E-3,3.2729999999999999E-3,4.0740000000000004E-3,4.8669999999999998E-3,null,223,{"$error":"#REF!"},{"$error":"#REF!"},{"$error":"#REF!"},{"$error":"#REF!"},{"$error":"#REF!"},null,null,null,null,null,null,null,null,null,null,null,null,null,null,null,null,null,"2013-11-01",5.0000000000000001E-3,"2013-11-01",5.0000000000000001E-3,null,"2013-11-01",7.1999999999999998E-3,"2013-11-01","2013-11-01",7.1999999999999998E-3,null,"2013-11-01","2013-11-01","","","",7.1999999999999998E-3,7.1999999999999998E-3,0.62690000000000001,null,null,null,null,null,null,null,null,null,null,null,null,null,"2018-11-01",1.9E-3,null,"2018-11-01",3.7149999999999128E-3]
[null,"2017-12-01",937,"2017-12-01",937,null,"2018-12-01",-1.6000000000000001E-3,"2018-12-01",-1.6000000000000001E-3,null,"2018-12-01",1.5E-3,"2018-12-01",1.5E-3,null,"2018-12-01",0,"2018-12-01",0,null,null,null,"","",null,"2014-01-10",2.9610000000000001E-3,3.7690000000000002E-3,4.5700000000000003E-3,5.3629999999999997E-3,"2013-12-01",2.9610000000000001E-3,3.7690000000000002E-3,4.5700000000000003E-3,5.3629999999999997E-3,null,"2018-12-01",0,null,"2018-12-01",2.4659999999999999E-3,3.2729999999999999E-3,4.0740000000000004E-3,4.8669999999999998E-3,null,224,{"$error":"#REF!"},{"$error":"#REF!"},{"$error":"#REF!"},{"$error":"#REF!"},{"$error":"#REF!"},null,null,null,null,null,null,null,null,null,null,null,null,null,null,null,null,null,"2013-12-01",5.0000000000000001E-3,"2013-12-01",5.0000000000000001E-3,null,"2013-12-01",7.9000000000000008E-3,"2013-12-01","2013-12-01",7.9000000000000008E-3,null,"2013-12-01","2013-12-01","","","",7.9000000000000008E-3,7.9000000000000008E-3,0.61899999999999999,null,null,null,null,null,null,null,null,null,null,null,null,null,"2018-12-01",-1.6000000000000001E-3,null,"2018-12-01",3.7149999999999128E-3]
[null,"2018-01-01",954,"2018-01-01",954,null,"2019-01-01",3.0000000000000001E-3,"2019-01-01",3.0000000000000001E-3,null,"2019-01-01",3.2000000000000002E-3,"2019-01-01",3.2000000000000002E-3,null,"2019-01-01",0,"2019-01-01",0,null,null,null,"","",null,"2014-02-10",3.5950000000000001E-3,4.4029999999999998E-3,5.2040000000000003E-3,5.999E-3,"2014-01-01",3.5950000000000001E-3,4.4029999999999998E-3,5.2040000000000003E-3,5.999E-3,null,"2019-01-01",0,null,"2019-01-01",2.4659999999999999E-3,3.2729999999999999E-3,4.0740000000000004E-3,4.8669999999999998E-3,null,225,{"$error":"#REF!"},{"$error":"#REF!"},{"$error":"#REF!"},{"$error":"#REF!"},{"$error":"#REF!"},null,null,null,null,null,null,null,null,null,null,null,null,null,null,null,null,null,"2014-01-01",5.0000000000000001E-3,"2014-01-01",5.0000000000000001E-3,null,"2014-01-01",8.5000000000000006E-3,"2014-01-01","2014-01-01",8.5000000000000006E-3,null,"2014-01-01","2014-01-01","","","",8.5000000000000006E-3,8.5000000000000006E-3,0.61050000000000004,null,null,null,null,null,null,null,null,null,null,null,null,null,"2019-01-01",3.0000000000000001E-3,null,"2019-01-01",3.7149999999999128E-3]
[null,"2018-02-01",954,"2018-02-01",954,null,"2019-02-01",3.3999999999999998E-3,"2019-02-01",3.3999999999999998E-3,null,"2019-02-01",4.3E-3,"2019-02-01",4.3E-3,null,"2019-02-01",0,"2019-02-01",0,null,null,null,"","",null,"2014-03-10",3.0040000000000002E-3,3.8119999999999999E-3,4.6129999999999999E-3,5.4070000000000003E-3,"2014-02-01",3.0040000000000002E-3,3.8119999999999999E-3,4.6129999999999999E-3,5.4070000000000003E-3,null,"2019-02-01",0,null,"2019-02-01",2.4659999999999999E-3,3.2729999999999999E-3,4.0740000000000004E-3,4.8669999999999998E-3,null,226,{"$error":"#REF!"},{"$error":"#REF!"},{"$error":"#REF!"},{"$error":"#REF!"},{"$error":"#REF!"},null,null,null,null,null,null,null,null,null,null,null,null,null,null,null,null,null,"2014-02-01",5.0000000000000001E-3,"2014-02-01",5.0000000000000001E-3,null,"2014-02-01",7.9000000000000008E-3,"2014-02-01","2014-02-01",7.9000000000000008E-3,null,"2014-02-01","2014-02-01","","","",7.9000000000000008E-3,7.9000000000000008E-3,0.60260000000000002,null,null,null,null,null,null,null,null,null,null,null,null,null,"2019-02-01",3.3999999999999998E-3,null,"2019-02-01",3.7149999999999128E-3]
[null,"2018-03-01",954,"2018-03-01",954,null,"2019-03-01",5.4000000000000003E-3,"2019-03-01",5.4000000000000003E-3,null,"2019-03-01",7.4999999999999997E-3,"2019-03-01",7.4999999999999997E-3,null,"2019-03-01",0,"2019-03-01",0,null,null,null,"","",null,"2014-04-10",2.7320000000000001E-3,3.5400000000000002E-3,4.3410000000000002E-3,5.1339999999999997E-3,"2014-03-01",2.7320000000000001E-3,3.5400000000000002E-3,4.3410000000000002E-3,5.1339999999999997E-3,null,"2019-03-01",0,null,"2019-03-01",2.4659999999999999E-3,3.2729999999999999E-3,4.0740000000000004E-3,4.8669999999999998E-3,null,227,{"$error":"#REF!"},{"$error":"#REF!"},{"$error":"#REF!"},{"$error":"#REF!"},{"$error":"#REF!"},null,null,null,null,null,null,null,null,null,null,null,null,null,null,null,null,null,"2014-03-01",5.0000000000000001E-3,"2014-03-01",5.0000000000000001E-3,null,"2014-03-01",7.7000000000000002E-3,"2014-03-01","2014-03-01",7.7000000000000002E-3,null,"2014-03-01","2014-03-01","","","",7.7000000000000002E-3,7.7000000000000002E-3,0.59489999999999998,null,null,null,null,null,null,null,null,null,null,null,null,null,"2019-03-01",5.4000000000000003E-3,null,"2019-03-01",3.7149999999999128E-3]
[null,"2018-04-01",954,"2018-04-01",954,null,"2019-04-01",7.1999999999999998E-3,"2019-04-01",7.1999999999999998E-3,null,"2019-04-01",5.7000000000000002E-3,"2019-04-01",5.7000000000000002E-3,null,"2019-04-01",0,"2019-04-01",0,null,null,null,"","",null,"2014-05-10",2.9260000000000002E-3,3.7339999999999999E-3,4.5339999999999998E-3,5.3280000000000003E-3,"2014-04-01",2.9260000000000002E-3,3.7339999999999999E-3,4.5339999999999998E-3,5.3280000000000003E-3,null,"2019-04-01",0,null,"2019-04-01",2.4659999999999999E-3,3.2729999999999999E-3,4.0740000000000004E-3,4.8669999999999998E-3,null,228,{"$error":"#REF!"},{"$error":"#REF!"},{"$error":"#REF!"},{"$error":"#REF!"},{"$error":"#REF!"},null,null,null,null,null,null,null,null,null,null,null,null,null,null,null,null,null,"2014-04-01",5.0000000000000001E-3,"2014-04-01",5.0000000000000001E-3,null,"2014-04-01",8.2000000000000007E-3,"2014-04-01","2014-04-01",8.2000000000000007E-3,null,"2014-04-01","2014-04-01","","","",8.2000000000000007E-3,8.2000000000000007E-3,0.5867,null,null,null,null,null,null,null,null,null,null,null,null,null,"2019-04-01",7.1999999999999998E-3,null,"2019-04-01",3.7149999999999128E-3]
[null,"2018-05-01",954,"2018-05-01",954,null,"2019-05-01",3.5000000000000001E-3,"2019-05-01",3.5000000000000001E-3,null,"2019-05-01",1.2999999999999999E-3,"2019-05-01",1.2999999999999999E-3,null,"2019-05-01",0,"2019-05-01",0,null,null,null,"","",null,"2014-06-10",3.0709999999999999E-3,3.8790000000000001E-3,4.6800000000000001E-3,5.4739999999999997E-3,"2014-05-01",3.0709999999999999E-3,3.8790000000000001E-3,4.6800000000000001E-3,5.4739999999999997E-3,null,"2019-05-01",0,null,"2019-05-01",2.4659999999999999E-3,3.2729999999999999E-3,4.0740000000000004E-3,4.8669999999999998E-3,null,229,{"$error":"#REF!"},{"$error":"#REF!"},{"$error":"#REF!"},{"$error":"#REF!"},{"$error":"#REF!"},null,null,null,null,null,null,null,null,null,null,null,null,null,null,null,null,null,"2014-05-01",5.0000000000000001E-3,"2014-05-01",5.0000000000000001E-3,null,"2014-05-01",8.6999999999999994E-3,"2014-05-01","2014-05-01",8.6999999999999994E-3,null,"2014-05-01","2014-05-01","","","",8.6999999999999994E-3,8.6999999999999994E-3,0.57799999999999996,null,null,null,null,null,null,null,null,null,null,null,null,null,"2019-05-01",3.5000000000000001E-3,null,"2019-05-01",3.7149999999999128E-3]
[null,"2018-06-01",954,"2018-06-01",954,null,"2019-06-01",5.9999999999999995E-4,"2019-06-01",5.9999999999999995E-4,null,"2019-06-01",1E-4,"2019-06-01",1E-4,null,"2019-06-01",0,"2019-06-01",0,null,null,null,"","",null,"2014-07-10",2.9320000000000001E-3,3.7399999999999998E-3,4.5409999999999999E-3,5.3340000000000002E-3,"2014-06-01",2.9320000000000001E-3,3.7399999999999998E-3,4.5409999999999999E-3,5.3340000000000002E-3,null,"2019-06-01",0,null,"2019-06-01",2.4659999999999999E-3,3.2729999999999999E-3,4.0740000000000004E-3,4.8669999999999998E-3,null,230,{"$error":"#REF!"},{"$error":"#REF!"},{"$error":"#REF!"},{"$error":"#REF!"},{"$error":"#REF!"},null,null,null,null,null,null,null,null,null,null,null,null,null,null,null,null,null,"2014-06-01",5.0000000000000001E-3,"2014-06-01",5.0000000000000001E-3,null,"2014-06-01",8.2000000000000007E-3,"2014-06-01","2014-06-01",8.2000000000000007E-3,null,"2014-06-01","2014-06-01","","","",8.2000000000000007E-3,8.2000000000000007E-3,0.56979999999999997,null,null,null,null,null,null,null,null,null,null,null,null,null,"2019-06-01",5.9999999999999995E-4,null,"2019-06-01",3.7149999999999128E-3]
[null,"2018-07-01",954,"2018-07-01",954,null,"2019-07-01",8.9999999999999998E-4,"2019-07-01",8.9999999999999998E-4,null,"2019-07-01",1.9E-3,"2019-07-01",1.9E-3,null,"2019-07-01",0,"2019-07-01",0,null,null,null,"","",null,"2014-08-10",3.522E-3,4.3309999999999998E-3,5.1320000000000003E-3,5.9259999999999998E-3,"2014-07-01",3.522E-3,4.3309999999999998E-3,5.1320000000000003E-3,5.9259999999999998E-3,null,"2019-07-01",0,null,"2019-07-01",2.4659999999999999E-3,3.2729999999999999E-3,4.0740000000000004E-3,4.8669999999999998E-3,null,231,{"$error":"#REF!"},{"$error":"#REF!"},{"$error":"#REF!"},{"$error":"#REF!"},{"$error":"#REF!"},null,null,null,null,null,null,null,null,null,null,null,null,null,null,null,null,null,"2014-07-01",5.0000000000000001E-3,"2014-07-01",5.0000000000000001E-3,null,"2014-07-01",9.4999999999999998E-3,"2014-07-01","2014-07-01",9.4999999999999998E-3,null,"2014-07-01","2014-07-01","","","",9.4999999999999998E-3,9.4999999999999998E-3,0.56030000000000002,null,null,null,null,null,null,null,null,null,null,null,null,null,"2019-07-01",8.9999999999999998E-4,null,"2019-07-01",3.7149999999999128E-3]
[null,"2018-08-01",954,"2018-08-01",954,null,"2019-08-01",8.0000000000000004E-4,"2019-08-01",8.0000000000000004E-4,null,"2019-08-01",1.1000000000000001E-3,"2019-08-01",1.1000000000000001E-3,null,"2019-08-01",0,"2019-08-01",0,null,null,null,"","",null,"2014-09-10",3.0690000000000001E-3,3.8769999999999998E-3,4.6779999999999999E-3,5.4720000000000003E-3,"2014-08-01",3.0690000000000001E-3,3.8769999999999998E-3,4.6779999999999999E-3,5.4720000000000003E-3,null,"2019-08-01",0,null,"2019-08-01",2.4659999999999999E-3,3.2729999999999999E-3,4.0740000000000004E-3,4.8669999999999998E-3,null,232,{"$error":"#REF!"},{"$error":"#REF!"},{"$error":"#REF!"},{"$error":"#REF!"},{"$error":"#REF!"},null,null,null,null,null,null,null,null,null,null,null,null,null,null,null,null,null,"2014-08-01",5.0000000000000001E-3,"2014-08-01",5.0000000000000001E-3,null,"2014-08-01",8.6999999999999994E-3,"2014-08-01","2014-08-01",8.6999999999999994E-3,null,"2014-08-01","2014-08-01","","","",8.6999999999999994E-3,8.6999999999999994E-3,0.55159999999999998,null,null,null,null,null,null,null,null,null,null,null,null,null,"2019-08-01",8.0000000000000004E-4,null,"2019-08-01",3.7149999999999128E-3]
[null,"2018-09-01",954,"2018-09-01",954,null,"2019-09-01",8.9999999999999998E-4,"2019-09-01",8.9999999999999998E-4,null,"2019-09-01",-4.0000000000000002E-4,"2019-09-01",-4.0000000000000002E-4,null,"2019-09-01",0,"2019-09-01",0,null,null,null,"","",null,"2014-10-10",3.3409999999999998E-3,4.1489999999999999E-3,4.9500000000000004E-3,5.744E-3,"2014-09-01",3.3409999999999998E-3,4.1489999999999999E-3,4.9500000000000004E-3,5.744E-3,null,"2019-09-01",0,null,"2019-09-01",2.4659999999999999E-3,3.2729999999999999E-3,4.0740000000000004E-3,4.8669999999999998E-3,null,233,{"$error":"#REF!"},{"$error":"#REF!"},{"$error":"#REF!"},{"$error":"#REF!"},{"$error":"#REF!"},null,null,null,null,null,null,null,null,null,null,null,null,null,null,null,null,null,"2014-09-01",5.0000000000000001E-3,"2014-09-01",5.0000000000000001E-3,null,"2014-09-01",9.1000000000000004E-3,"2014-09-01","2014-09-01",9.1000000000000004E-3,null,"2014-09-01","2014-09-01","","","",9.1000000000000004E-3,9.1000000000000004E-3,0.54249999999999998,null,null,null,null,null,null,null,null,null,null,null,null,null,"2019-09-01",8.9999999999999998E-4,null,"2019-09-01",3.4339999999999371E-3]
[null,"2018-10-01",954,"2018-10-01",954,null,"2019-10-01",8.9999999999999998E-4,"2019-10-01",8.9999999999999998E-4,null,"2019-10-01",1E-3,"2019-10-01",1E-3,null,"2019-10-01",0,"2019-10-01",0,null,null,null,"","",null,"2014-11-10",3.506E-3,4.3150000000000003E-3,5.1159999999999999E-3,5.9100000000000003E-3,"2014-10-01",3.506E-3,4.3150000000000003E-3,5.1159999999999999E-3,5.9100000000000003E-3,null,"2019-10-01",0,null,"2019-10-01",2.4659999999999999E-3,3.2729999999999999E-3,4.0740000000000004E-3,4.8669999999999998E-3,null,234,{"$error":"#REF!"},{"$error":"#REF!"},{"$error":"#REF!"},{"$error":"#REF!"},{"$error":"#REF!"},null,null,null,null,null,null,null,null,null,null,null,null,null,null,null,null,null,"2014-10-01",5.0000000000000001E-3,"2014-10-01",5.0000000000000001E-3,null,"2014-10-01",9.4999999999999998E-3,"2014-10-01","2014-10-01",9.4999999999999998E-3,null,"2014-10-01","2014-10-01","","","",9.4999999999999998E-3,9.4999999999999998E-3,0.53300000000000003,null,null,null,null,null,null,null,null,null,null,null,null,null,"2019-10-01",8.9999999999999998E-4,null,"2019-10-01",3.4339999999999371E-3]
[null,"2018-11-01",954,"2018-11-01",954,null,"2019-11-01",1.4E-3,"2019-11-01",1.4E-3,null,"2019-11-01",5.1000000000000004E-3,"2019-11-01",5.1000000000000004E-3,null,"2019-11-01",0,"2019-11-01",0,null,null,null,"","",null,"2014-12-10",2.9499999999999999E-3,3.7580000000000001E-3,4.5589999999999997E-3,5.352E-3,"2014-11-01",2.9499999999999999E-3,3.7580000000000001E-3,4.5589999999999997E-3,5.352E-3,null,"2019-11-01",0,null,"2019-11-01",2.4659999999999999E-3,3.2729999999999999E-3,4.0740000000000004E-3,4.8669999999999998E-3,null,235,{"$error":"#REF!"},{"$error":"#REF!"},{"$error":"#REF!"},{"$error":"#REF!"},{"$error":"#REF!"},null,null,null,null,null,null,null,null,null,null,null,null,null,null,null,null,null,"2014-11-01",5.0000000000000001E-3,"2014-11-01",5.0000000000000001E-3,null,"2014-11-01",8.3999999999999995E-3,"2014-11-01","2014-11-01",8.3999999999999995E-3,null,"2014-11-01","2014-11-01","","",{"$f":"+IF(OR(COD_JUROS<>3,CD234=\"\"),\"\",BU235)","v":""},8.3999999999999995E-3,8.3999999999999995E-3,0.52460000000000007,null,null,null,null,null,null,null,null,null,null,null,null,null,"2019-11-01",1.4E-3,null,"2019-11-01",3.1529999999999614E-3]
[null,"2018-12-01",954,"2018-12-01",954,null,"2019-12-01",1.0500000000000001E-2,"2019-12-01",1.0500000000000001E-2,null,"2019-12-01",1.15E-2,"2019-12-01",1.15E-2,null,"2019-12-01",0,"2019-12-01",0,null,null,null,"","",null,"2015-01-10",3.5209999999999998E-3,4.3299999999999996E-3,5.1310000000000001E-3,5.9249999999999997E-3,"2014-12-01",3.5209999999999998E-3,4.3299999999999996E-3,5.1310000000000001E-3,5.9249999999999997E-3,null,"2019-12-01",0,null,"2019-12-01",2.4659999999999999E-3,3.2729999999999999E-3,4.0740000000000004E-3,4.8669999999999998E-3,null,236,{"$error":"#REF!"},{"$error":"#REF!"},{"$error":"#REF!"},{"$error":"#REF!"},{"$error":"#REF!"},null,null,null,null,null,null,null,null,null,null,null,null,null,null,null,null,null,"2014-12-01",5.0000000000000001E-3,"2014-12-01",5.0000000000000001E-3,null,"2014-12-01",9.5999999999999992E-3,"2014-12-01","2014-12-01",9.5999999999999992E-3,null,"2014-12-01","2014-12-01","","","",9.5999999999999992E-3,9.5999999999999992E-3,0.51500000000000001,null,null,null,null,null,null,null,null,null,null,null,null,null,"2019-12-01",1.0500000000000001E-2,null,"2019-12-01",2.8710000000000679E-3]
[null,"2019-01-01",998,"2019-01-01",998,null,"2020-01-01",7.1000000000000004E-3,"2020-01-01",7.1000000000000004E-3,null,"2020-01-01",2.0999999999999999E-3,"2020-01-01",2.0999999999999999E-3,null,"2020-01-01",0,"2020-01-01",0,null,null,null,"","",null,"2015-02-10",3.346E-3,4.1539999999999997E-3,4.9550000000000002E-3,5.7489999999999998E-3,"2015-01-01",3.346E-3,4.1539999999999997E-3,4.9550000000000002E-3,5.7489999999999998E-3,null,"2020-01-01",0,null,"2020-01-01",2.4659999999999999E-3,3.2729999999999999E-3,4.0740000000000004E-3,4.8669999999999998E-3,null,237,{"$error":"#REF!"},{"$error":"#REF!"},{"$error":"#REF!"},{"$error":"#REF!"},{"$error":"#REF!"},null,null,null,null,null,null,null,null,null,null,null,null,null,null,null,null,null,"2015-01-01",5.0000000000000001E-3,"2015-01-01",5.0000000000000001E-3,null,"2015-01-01",9.4000000000000004E-3,"2015-01-01","2015-01-01",9.4000000000000004E-3,null,"2015-01-01","2015-01-01","","","",9.4000000000000004E-3,9.4000000000000004E-3,0.50560000000000005,null,null,null,null,null,null,null,null,null,null,null,null,null,"2020-01-01",7.1000000000000004E-3,null,"2020-01-01",2.8710000000000679E-3]
[null,"2019-02-01",998,"2019-02-01",998,null,"2020-02-01",2.2000000000000001E-3,"2020-02-01",2.2000000000000001E-3,null,"2020-02-01",2.5000000000000001E-3,"2020-02-01",2.5000000000000001E-3,null,"2020-02-01",0,"2020-02-01",0,null,null,null,"","",null,"2015-03-10",2.6340000000000001E-3,3.4420000000000002E-3,4.2420000000000001E-3,5.0359999999999997E-3,"2015-02-01",2.6340000000000001E-3,3.4420000000000002E-3,4.2420000000000001E-3,5.0359999999999997E-3,null,"2020-02-01",0,null,"2020-02-01",2.4659999999999999E-3,3.2729999999999999E-3,4.0740000000000004E-3,4.8669999999999998E-3,null,238,{"$error":"#REF!"},{"$error":"#REF!"},{"$error":"#REF!"},{"$error":"#REF!"},{"$error":"#REF!"},null,null,null,null,null,null,null,null,null,null,null,null,null,null,null,null,null,"2015-02-01",5.0000000000000001E-3,"2015-02-01",5.0000000000000001E-3,null,"2015-02-01",8.2000000000000007E-3,"2015-02-01","2015-02-01",8.2000000000000007E-3,null,"2015-02-01","2015-02-01","","","",8.2000000000000007E-3,8.2000000000000007E-3,0.49740000000000006,null,null,null,null,null,null,null,null,null,null,null,null,null,"2020-02-01",2.2000000000000001E-3,null,"2020-02-01",2.5880000000000347E-3]
[null,"2019-03-01",998,"2019-03-01",998,null,"2020-03-01",2.0000000000000001E-4,"2020-03-01",2.0000000000000001E-4,null,"2020-03-01",6.9999999999999999E-4,"2020-03-01",6.9999999999999999E-4,null,"2020-03-01",0,"2020-03-01",0,null,null,null,"","",null,"2015-04-10",3.7650000000000001E-3,4.5729999999999998E-3,5.3749999999999996E-3,6.169E-3,"2015-03-01",3.7650000000000001E-3,4.5729999999999998E-3,5.3749999999999996E-3,6.169E-3,null,{"$f":"+S239","v":"2020-03-01"},{"$f":"+T239","v":0},null,"2020-03-01",2.4659999999999999E-3,3.2729999999999999E-3,4.0740000000000004E-3,4.8669999999999998E-3,null,239,{"$error":"#REF!"},{"$error":"#REF!"},{"$error":"#REF!"},{"$error":"#REF!"},{"$error":"#REF!"},null,null,null,null,null,null,null,null,null,null,null,null,null,null,null,null,null,"2015-03-01",5.0000000000000001E-3,"2015-03-01",5.0000000000000001E-3,null,"2015-03-01",1.04E-2,"2015-03-01","2015-03-01",1.04E-2,null,"2015-03-01","2015-03-01","","","",1.04E-2,1.04E-2,0.48700000000000004,null,null,null,null,null,null,null,null,null,null,null,null,null,"2020-03-01",2.0000000000000001E-4,null,"2020-03-01",2.5880000000000347E-3]
[null,"2019-04-01",998,"2019-04-01",998,null,"2020-04-01",-1E-4,"2020-04-01",-1E-4,null,"2020-04-01",-3.0999999999999999E-3,"2020-04-01",-3.0999999999999999E-3,null,"2020-04-01",0,"2020-04-01",0,null,null,null,"","",null,"2015-05-10",3.542E-3,4.3509999999999998E-3,5.1520000000000003E-3,5.9459999999999999E-3,{"$f":"+IF(AND(TRIM(AA240)=\"\",TRIM(AA239)<>\"\"),EDATE(AF239,1),IF(TRIM(AA240)=\"\",\"\",EOMONTH(AA240,-2)+1))","v":"2015-04-01"},3.542E-3,4.3509999999999998E-3,5.1520000000000003E-3,5.9459999999999999E-3,null,"2020-04-01",0,null,"2020-04-01",2.4659999999999999E-3,3.2729999999999999E-3,4.0740000000000004E-3,4.8669999999999998E-3,null,240,{"$error":"#REF!"},{"$error":"#REF!"},{"$error":"#REF!"},{"$error":"#REF!"},{"$error":"#REF!"},null,null,null,null,null,null,null,null,null,null,null,null,null,null,null,null,null,"2015-04-01",5.0000000000000001E-3,"2015-04-01",5.0000000000000001E-3,null,"2015-04-01",9.4999999999999998E-3,"2015-04-01","2015-04-01",9.4999999999999998E-3,null,"2015-04-01","2015-04-01","","","",9.4999999999999998E-3,9.4999999999999998E-3,0.47750000000000004,null,null,null,null,null,null,null,null,null,null,null,null,null,"2020-04-01",-1E-4,null,"2020-04-01",2.4660000000000792E-3]
[null,"2019-05-01",998,"2019-05-01",998,null,"2020-05-01",-5.8999999999999999E-3,"2020-05-01",-5.8999999999999999E-3,null,"2020-05-01",-3.8E-3,"2020-05-01",-3.8E-3,null,"2020-05-01",0,"2020-05-01",0,null,null,null,"","",null,"2015-06-10",3.6219999999999998E-3,4.4299999999999999E-3,5.2310000000000004E-3,6.0260000000000001E-3,"2015-05-01",{"$f":"IF(TRIM(AB241)=\"\",\"\",AB241)","v":3.6219999999999998E-3},{"$f":"IF(TRIM(AC241)=\"\",\"\",AC241)","v":4.4299999999999999E-3},{"$f":"IF(TRIM(AD241)=\"\",\"\",AD241)","v":5.2310000000000004E-3},{"$f":"IF(TRIM(AE241)=\"\",\"\",AE241)","v":6.0260000000000001E-3},null,"2020-05-01",0,null,"2020-05-01",2.4659999999999999E-3,3.2729999999999999E-3,4.0740000000000004E-3,4.8669999999999998E-3,null,241,{"$error":"#REF!"},{"$error":"#REF!"},{"$error":"#REF!"},{"$error":"#REF!"},{"$error":"#REF!"},null,null,null,null,null,null,null,null,null,null,null,null,null,null,null,null,null,"2015-05-01",5.0000000000000001E-3,"2015-05-01",5.0000000000000001E-3,null,"2015-05-01",9.9000000000000008E-3,"2015-05-01","2015-05-01",9.9000000000000008E-3,null,"2015-05-01","2015-05-01","","","",9.9000000000000008E-3,9.9000000000000008E-3,0.46760000000000002,null,null,null,null,null,null,null,null,null,null,null,null,null,"2020-05-01",-5.8999999999999999E-3,null,"2020-05-01",2.1619999999999973E-3]
[null,"2019-06-01",998,"2019-06-01",998,null,"2020-06-01",2.0000000000000001E-4,"2020-06-01",2.0000000000000001E-4,null,"2020-06-01",2.5999999999999999E-3,"2020-06-01",2.5999999999999999E-3,null,"2020-06-01",0,"2020-06-01",0,null,null,null,"","",null,"2015-07-10",4.2830000000000003E-3,5.0920000000000002E-3,5.8939999999999999E-3,6.6889999999999996E-3,"2015-06-01",4.2830000000000003E-3,5.0920000000000002E-3,5.8939999999999999E-3,6.6889999999999996E-3,null,"2020-06-01",0,null,"2020-06-01",2.4659999999999999E-3,3.2729999999999999E-3,4.0740000000000004E-3,4.8669999999999998E-3,null,242,{"$error":"#REF!"},{"$error":"#REF!"},{"$error":"#REF!"},{"$error":"#REF!"},{"$error":"#REF!"},null,null,null,null,null,null,null,null,null,null,null,null,null,null,null,null,null,"2015-06-01",5.0000000000000001E-3,"2015-06-01",5.0000000000000001E-3,null,"2015-06-01",1.0699999999999999E-2,"2015-06-01","2015-06-01",1.0699999999999999E-2,null,"2015-06-01","2015-06-01","","","",1.0699999999999999E-2,1.0699999999999999E-2,0.45690000000000003,null,null,null,null,null,null,null,null,null,null,null,null,null,"2020-06-01",2.0000000000000001E-4,null,"2020-06-01",2.1619999999999973E-3]
[null,"2019-07-01",998,"2019-07-01",998,null,"2020-07-01",3.0000000000000001E-3,"2020-07-01",3.0000000000000001E-3,null,"2020-07-01",3.5999999999999999E-3,{"$f":"+IF(AND(M243=\"\",M242<>\"\"),EDATE(N242,1),IF(TRIM(L243)=\"\",\"\",TRUNC(L243,0)))","v":"2020-07-01"},3.5999999999999999E-3,null,"2020-07-01",0,"2020-07-01",0,null,null,null,"","",null,"2015-08-10",4.7759999999999999E-3,5.5859999999999998E-3,6.3879999999999996E-3,7.1830000000000001E-3,"2015-07-01",4.7759999999999999E-3,5.5859999999999998E-3,6.3879999999999996E-3,7.1830000000000001E-3,null,"2020-07-01",0,null,"2020-07-01",2.4659999999999999E-3,3.2729999999999999E-3,4.0740000000000004E-3,4.8669999999999998E-3,null,243,{"$error":"#REF!"},{"$error":"#REF!"},{"$error":"#REF!"},{"$error":"#REF!"},{"$error":"#REF!"},null,null,null,null,null,null,null,null,null,null,null,null,null,null,null,null,null,"2015-07-01",5.0000000000000001E-3,"2015-07-01",5.0000000000000001E-3,null,"2015-07-01",1.18E-2,"2015-07-01","2015-07-01",1.18E-2,null,"2015-07-01","2015-07-01","","","",1.18E-2,1.18E-2,0.44510000000000005,null,null,null,null,null,null,null,null,null,null,null,null,null,"2020-07-01",3.0000000000000001E-3,null,"2020-07-01",1.7329999999999846E-3]
[null,"2019-08-01",998,"2019-08-01",998,null,"2020-08-01",2.3E-3,"2020-08-01",2.3E-3,null,"2020-08-01",2.3999999999999998E-3,"2020-08-01",2.3999999999999998E-3,null,"2020-08-01",0,"2020-08-01",0,null,null,null,"","",null,"2015-09-10",4.3369999999999997E-3,5.1460000000000004E-3,5.9480000000000002E-3,6.7429999999999999E-3,"2015-08-01",4.3369999999999997E-3,5.1460000000000004E-3,5.9480000000000002E-3,6.7429999999999999E-3,null,"2020-08-01",0,null,"2020-08-01",2.4659999999999999E-3,3.2729999999999999E-3,4.0740000000000004E-3,4.8669999999999998E-3,null,244,{"$error":"#REF!"},{"$error":"#REF!"},{"$error":"#REF!"},{"$error":"#REF!"},{"$error":"#REF!"},null,null,null,null,null,null,null,null,null,null,null,null,null,null,null,null,null,"2015-08-01",5.0000000000000001E-3,"2015-08-01",5.0000000000000001E-3,null,"2015-08-01",1.11E-2,"2015-08-01","2015-08-01",1.11E-2,null,"2015-08-01","2015-08-01","","","",1.11E-2,1.11E-2,0.43400000000000005,null,null,null,null,null,null,null,null,null,null,null,null,null,{"$f":"+I244","v":"2020-08-01"},{"$f":"+J244","v":2.3E-3},null,"2020-08-01",1.3030000000000541E-3]
[null,"2019-09-01",998,"2019-09-01",998,null,"2020-09-01",4.4999999999999997E-3,"2020-09-01",4.4999999999999997E-3,null,"2020-09-01",6.4000000000000003E-3,"2020-09-01",6.4000000000000003E-3,null,"2020-09-01",0,"2020-09-01",0,null,null,null,"","",null,"2015-10-10",4.3899999999999998E-3,5.1999999999999998E-3,6.0010000000000003E-3,6.796E-3,"2015-09-01",4.3899999999999998E-3,5.1999999999999998E-3,6.0010000000000003E-3,6.796E-3,null,"2020-09-01",0,null,{"$f":"IF(AO244=\"\",\"\",IF(EDATE(AO244,1)>VMES99,\"\",EDATE(AO244,1)))","v":"2020-09-01"},{"$f":"+IF(DB245=\"\",\"\",0.002466)","v":2.4659999999999999E-3},{"$f":"+IF(DB245=\"\",\"\",0.003273)","v":3.2729999999999999E-3},{"$f":"+IF(DB245=\"\",\"\",0.004074)","v":4.0740000000000004E-3},{"$f":"+IF(DB245=\"\",\"\",0.004867)","v":4.8669999999999998E-3},null,245,{"$error":"#REF!"},{"$error":"#REF!"},{"$error":"#REF!"},{"$error":"#REF!"},{"$error":"#REF!"},null,null,null,null,null,null,null,null,null,null,null,null,null,null,null,null,null,"2015-09-01",5.0000000000000001E-3,"2015-09-01",5.0000000000000001E-3,null,"2015-09-01",1.11E-2,"2015-09-01","2015-09-01",1.11E-2,null,"2015-09-01","2015-09-01","","","",1.11E-2,1.11E-2,0.42290000000000005,null,null,null,null,null,null,null,null,null,null,null,null,null,"2020-09-01",4.4999999999999997E-3,null,"2020-09-01",1.3030000000000541E-3]
[null,"2019-10-01",998,"2019-10-01",998,null,"2020-10-01",9.4000000000000004E-3,"2020-10-01",9.4000000000000004E-3,null,"2020-10-01",8.6E-3,"2020-10-01",8.6E-3,null,"2020-10-01",0,"2020-10-01",0,null,null,null,"","",null,"2015-11-10",4.2599999999999999E-3,5.0689999999999997E-3,5.8710000000000004E-3,6.6660000000000001E-3,"2015-10-01",4.2599999999999999E-3,5.0689999999999997E-3,5.8710000000000004E-3,6.6660000000000001E-3,null,"2020-10-01",0,null,"2020-10-01",2.4659999999999999E-3,3.2729999999999999E-3,4.0740000000000004E-3,4.8669999999999998E-3,null,246,{"$error":"#REF!"},{"$error":"#REF!"},{"$error":"#REF!"},{"$error":"#REF!"},{"$error":"#REF!"},null,null,null,null,null,null,null,null,null,null,null,null,null,null,null,null,null,"2015-10-01",5.0000000000000001E-3,"2015-10-01",5.0000000000000001E-3,null,"2015-10-01",1.11E-2,"2015-10-01","2015-10-01",1.11E-2,null,"2015-10-01","2015-10-01","","","",1.11E-2,1.11E-2,0.41180000000000005,null,null,null,null,null,null,null,null,null,null,null,null,null,"2020-10-01",9.4000000000000004E-3,null,"2020-10-01",1.1589999999999101E-3]
[null,"2019-11-01",998,"2019-11-01",998,null,"2020-11-01",8.0999999999999996E-3,"2020-11-01",8.0999999999999996E-3,null,"2020-11-01",8.8999999999999999E-3,"2020-11-01",8.8999999999999999E-3,null,"2020-11-01",0,"2020-11-01",0,null,null,null,"","",null,"2015-12-10",3.7659999999999998E-3,4.5739999999999999E-3,5.3759999999999997E-3,6.1700000000000001E-3,"2015-11-01",3.7659999999999998E-3,4.5739999999999999E-3,5.3759999999999997E-3,6.1700000000000001E-3,null,"2020-11-01",0,null,"2020-11-01",2.4659999999999999E-3,3.2729999999999999E-3,4.0740000000000004E-3,4.8669999999999998E-3,null,247,{"$error":"#REF!"},{"$error":"#REF!"},{"$error":"#REF!"},{"$error":"#REF!"},{"$error":"#REF!"},null,null,null,null,null,null,null,null,null,null,null,null,null,null,null,null,null,"2015-11-01",5.0000000000000001E-3,"2015-11-01",5.0000000000000001E-3,null,"2015-11-01",1.06E-2,"2015-11-01","2015-11-01",1.06E-2,null,"2015-11-01","2015-11-01","","","",1.06E-2,1.06E-2,0.40120000000000006,null,null,null,null,null,null,null,null,null,null,null,null,null,"2020-11-01",8.0999999999999996E-3,null,"2020-11-01",1.1589999999999101E-3]
[null,"2019-12-01",998,"2019-12-01",998,null,"2020-12-01",1.06E-2,"2020-12-01",1.06E-2,null,"2020-12-01",1.35E-2,"2020-12-01",1.35E-2,null,"2020-12-01",0,"2020-12-01",0,null,null,null,"","",null,"2016-01-10",4.7210000000000004E-3,5.5310000000000003E-3,6.3330000000000001E-3,7.1279999999999998E-3,"2015-12-01",4.7210000000000004E-3,5.5310000000000003E-3,6.3330000000000001E-3,7.1279999999999998E-3,null,"2020-12-01",0,null,"2020-12-01",2.4659999999999999E-3,3.2729999999999999E-3,4.0740000000000004E-3,4.8669999999999998E-3,null,248,{"$error":"#REF!"},{"$error":"#REF!"},{"$error":"#REF!"},{"$error":"#REF!"},{"$error":"#REF!"},null,null,null,null,null,null,null,null,null,null,null,null,null,null,null,null,null,"2015-12-01",5.0000000000000001E-3,"2015-12-01",5.0000000000000001E-3,null,"2015-12-01",1.1599999999999999E-2,"2015-12-01","2015-12-01",1.1599999999999999E-2,null,"2015-12-01","2015-12-01","","","",1.1599999999999999E-2,1.1599999999999999E-2,0.38960000000000006,null,null,null,null,null,null,null,null,null,null,null,null,null,"2020-12-01",1.06E-2,null,"2020-12-01",1.1589999999999101E-3]
[null,"2020-01-01",1039,"2020-01-01",1039,null,"2021-01-01",7.7999999999999996E-3,"2021-01-01",7.7999999999999996E-3,null,"2021-01-01",2.5000000000000001E-3,"2021-01-01",2.5000000000000001E-3,null,"2021-01-01",0,"2021-01-01",0,null,null,null,"","",null,"2016-02-10",3.7889999999999998E-3,4.5979999999999997E-3,5.3990000000000002E-3,6.1929999999999997E-3,"2016-01-01",3.7889999999999998E-3,4.5979999999999997E-3,5.3990000000000002E-3,6.1929999999999997E-3,null,"2021-01-01",0,null,"2021-01-01",2.4659999999999999E-3,3.2729999999999999E-3,4.0740000000000004E-3,4.8669999999999998E-3,null,249,{"$error":"#REF!"},{"$error":"#REF!"},{"$error":"#REF!"},{"$error":"#REF!"},{"$error":"#REF!"},null,null,null,null,null,null,null,null,null,null,null,null,null,null,null,null,null,"2016-01-01",5.0000000000000001E-3,"2016-01-01",5.0000000000000001E-3,null,"2016-01-01",1.06E-2,"2016-01-01","2016-01-01",1.06E-2,null,"2016-01-01","2016-01-01","","","",1.06E-2,1.06E-2,0.37900000000000006,null,null,null,null,null,null,null,null,null,null,null,null,null,"2021-01-01",7.7999999999999996E-3,null,"2021-01-01",1.1589999999999101E-3]
[null,"2020-02-01",1045,"2020-02-01",1045,null,"2021-02-01",4.7999999999999996E-3,"2021-02-01",4.7999999999999996E-3,null,"2021-02-01",8.6E-3,"2021-02-01",8.6E-3,null,"2021-02-01",0,"2021-02-01",0,null,null,null,"","",null,"2016-03-10",3.4250000000000001E-3,4.2329999999999998E-3,5.0350000000000004E-3,5.829E-3,"2016-02-01",3.4250000000000001E-3,4.2329999999999998E-3,5.0350000000000004E-3,5.829E-3,null,"2021-02-01",0,null,"2021-02-01",2.4659999999999999E-3,3.2729999999999999E-3,4.0740000000000004E-3,4.8669999999999998E-3,null,250,{"$error":"#REF!"},{"$error":"#REF!"},{"$error":"#REF!"},{"$error":"#REF!"},{"$error":"#REF!"},null,null,null,null,null,null,null,null,null,null,null,null,null,null,null,null,null,"2016-02-01",5.0000000000000001E-3,"2016-02-01",5.0000000000000001E-3,null,"2016-02-01",0.01,"2016-02-01","2016-02-01",0.01,null,"2016-02-01","2016-02-01","","","",0.01,0.01,0.36900000000000005,null,null,null,null,null,null,null,null,null,null,null,null,null,"2021-02-01",4.7999999999999996E-3,null,"2021-02-01",1.1589999999999101E-3]
[null,"2020-03-01",1045,"2020-03-01",1045,null,"2021-03-01",9.2999999999999992E-3,"2021-03-01",9.2999999999999992E-3,null,"2021-03-01",9.2999999999999992E-3,"2021-03-01",9.2999999999999992E-3,null,"2021-03-01",0,"2021-03-01",0,null,null,null,"","",null,"2016-04-10",4.6389999999999999E-3,5.4479999999999997E-3,6.2500000000000003E-3,7.0460000000000002E-3,"2016-03-01",4.6389999999999999E-3,5.4479999999999997E-3,6.2500000000000003E-3,7.0460000000000002E-3,null,"2021-03-01",0,null,"2021-03-01",2.4659999999999999E-3,3.2729999999999999E-3,4.0740000000000004E-3,4.8669999999999998E-3,null,251,{"$error":"#REF!"},{"$error":"#REF!"},{"$error":"#REF!"},{"$error":"#REF!"},{"$error":"#REF!"},null,null,null,null,null,null,null,null,null,null,null,null,null,null,null,null,null,"2016-03-01",5.0000000000000001E-3,"2016-03-01",5.0000000000000001E-3,null,"2016-03-01",1.1599999999999999E-2,"2016-03-01","2016-03-01",1.1599999999999999E-2,null,"2016-03-01","2016-03-01","","","",1.1599999999999999E-2,1.1599999999999999E-2,0.35740000000000005,null,null,null,null,null,null,null,null,null,null,null,null,null,"2021-03-01",9.2999999999999992E-3,null,"2021-03-01",1.1589999999999101E-3]
[null,"2020-04-01",1045,"2020-04-01",1045,null,null,null,"2021-04-01",0,null,null,null,"2021-04-01",0,null,null,null,"2021-04-01",0,null,null,null,"","",null,"2016-05-10",3.7729999999999999E-3,4.581E-3,5.3829999999999998E-3,6.1770000000000002E-3,"2016-04-01",3.7729999999999999E-3,4.581E-3,5.3829999999999998E-3,6.1770000000000002E-3,null,"2021-04-01",0,null,"2021-04-01",2.4659999999999999E-3,3.2729999999999999E-3,4.0740000000000004E-3,4.8669999999999998E-3,null,252,{"$error":"#REF!"},{"$error":"#REF!"},{"$error":"#REF!"},{"$error":"#REF!"},{"$error":"#REF!"},null,null,null,null,null,null,null,null,null,null,null,null,null,null,null,null,null,"2016-04-01",5.0000000000000001E-3,"2016-04-01",5.0000000000000001E-3,null,"2016-04-01",1.06E-2,"2016-04-01","2016-04-01",1.06E-2,null,"2016-04-01","2016-04-01","","","",1.06E-2,1.06E-2,0.34680000000000005,null,null,null,null,null,null,null,null,null,null,null,null,null,"2021-04-01",0,null,"2021-04-01",1.1589999999999101E-3]
[null,"2020-05-01",1045,"2020-05-01",1045,null,null,null,"","",null,null,null,"","",null,null,null,"","",null,null,null,"","",null,"2016-06-10",4.0029999999999996E-3,4.8110000000000002E-3,5.6129999999999999E-3,6.4079999999999996E-3,"2016-05-01",4.0029999999999996E-3,4.8110000000000002E-3,5.6129999999999999E-3,6.4079999999999996E-3,null,"","",null,"2021-05-01","","","","",null,253,{"$error":"#REF!"},{"$error":"#REF!"},{"$error":"#REF!"},{"$error":"#REF!"},{"$error":"#REF!"},null,null,null,null,null,null,null,null,null,null,null,null,null,null,null,null,null,"2016-05-01",5.0000000000000001E-3,"2016-05-01",5.0000000000000001E-3,null,"2016-05-01",1.11E-2,"2016-05-01","2016-05-01",1.11E-2,null,"2016-05-01","2016-05-01","","","",1.11E-2,1.11E-2,0.33570000000000005,null,null,null,null,null,null,null,null,null,null,null,null,null,"","",null,"",""]
[null,"2020-06-01",1045,"2020-06-01",1045,null,null,null,"","",null,null,null,"","",null,null,null,"","",null,null,null,"","",null,"2016-07-10",4.5139999999999998E-3,5.3229999999999996E-3,6.1250000000000002E-3,6.9199999999999999E-3,"2016-06-01",4.5139999999999998E-3,5.3229999999999996E-3,6.1250000000000002E-3,6.9199999999999999E-3,null,"","",null,"2021-06-01","","","","",null,254,{"$error":"#REF!"},{"$error":"#REF!"},{"$error":"#REF!"},{"$error":"#REF!"},{"$error":"#REF!"},null,null,null,null,null,null,null,null,null,null,null,null,null,null,null,null,null,"2016-06-01",5.0000000000000001E-3,"2016-06-01",5.0000000000000001E-3,null,"2016-06-01",1.1599999999999999E-2,"2016-06-01","2016-06-01",1.1599999999999999E-2,null,"2016-06-01","2016-06-01","","","",1.1599999999999999E-2,1.1599999999999999E-2,0.32410000000000005,null,null,null,null,null,null,null,null,null,null,null,null,null,"","",null,"",""]
[null,"2020-07-01",1045,"2020-07-01",1045,null,null,null,"","",null,null,null,"","",null,null,null,"","",null,null,null,"","",null,"2016-08-10",4.091E-3,4.8999999999999998E-3,5.7010000000000003E-3,6.496E-3,"2016-07-01",{"$f":"IF(TRIM(AB255)=\"\",\"\",AB255)","v":4.091E-3},{"$f":"IF(TRIM(AC255)=\"\",\"\",AC255)","v":4.8999999999999998E-3},{"$f":"IF(TRIM(AD255)=\"\",\"\",AD255)","v":5.7010000000000003E-3},{"$f":"IF(TRIM(AE255)=\"\",\"\",AE255)","v":6.496E-3},null,"","",null,"2021-07-01","","","","",null,255,{"$error":"#REF!"},{"$error":"#REF!"},{"$error":"#REF!"},{"$error":"#REF!"},{"$error":"#REF!"},null,null,null,null,null,null,null,null,null,null,null,null,null,null,null,null,null,"2016-07-01",5.0000000000000001E-3,"2016-07-01",5.0000000000000001E-3,null,"2016-07-01",1.11E-2,"2016-07-01","2016-07-01",1.11E-2,null,"2016-07-01","2016-07-01","","","",1.11E-2,1.11E-2,0.31300000000000006,null,null,null,null,null,null,null,null,null,null,null,null,null,"","",null,"",""]
[null,"2020-08-01",1045,"2020-08-01",1045,null,null,null,"","",null,null,null,"","",null,null,null,"","",null,null,null,"","",null,"2016-09-10",5.0169999999999998E-3,5.8269999999999997E-3,6.6290000000000003E-3,7.424E-3,{"$f":"+IF(AND(TRIM(AA256)=\"\",TRIM(AA255)<>\"\"),EDATE(AF255,1),IF(TRIM(AA256)=\"\",\"\",EOMONTH(AA256,-2)+1))","v":"2016-08-01"},5.0169999999999998E-3,5.8269999999999997E-3,6.6290000000000003E-3,7.424E-3,null,"","",null,"2021-08-01","","","","",null,256,{"$error":"#REF!"},{"$error":"#REF!"},{"$error":"#REF!"},{"$error":"#REF!"},{"$error":"#REF!"},null,null,null,null,null,null,null,null,null,null,null,null,null,null,null,null,null,"2016-08-01",5.0000000000000001E-3,"2016-08-01",5.0000000000000001E-3,null,"2016-08-01",1.2200000000000001E-2,"2016-08-01","2016-08-01",1.2200000000000001E-2,null,"2016-08-01","2016-08-01","","","",1.2200000000000001E-2,1.2200000000000001E-2,0.30080000000000007,null,null,null,null,null,null,null,null,null,null,null,null,null,"","",null,"",""]
[null,"2020-09-01",1045,"2020-09-01",1045,null,null,null,"","",null,null,null,"","",null,null,null,"","",null,null,null,"","",null,"2016-10-10",4.045E-3,4.8529999999999997E-3,5.6550000000000003E-3,6.45E-3,{"$f":"+IF(AND(TRIM(AA257)=\"\",TRIM(AA256)<>\"\"),EDATE(AF256,1),IF(TRIM(AA257)=\"\",\"\",EOMONTH(AA257,-2)+1))","v":"2016-09-01"},4.045E-3,4.8529999999999997E-3,5.6550000000000003E-3,6.45E-3,null,"","",null,"2021-09-01","","","","",null,257,{"$error":"#REF!"},{"$error":"#REF!"},{"$error":"#REF!"},{"$error":"#REF!"},{"$error":"#REF!"},null,null,null,null,null,null,null,null,null,null,null,null,null,null,null,null,null,"2016-09-01",5.0000000000000001E-3,"2016-09-01",5.0000000000000001E-3,null,"2016-09-01",1.11E-2,"2016-09-01","2016-09-01",1.11E-2,null,"2016-09-01","2016-09-01","","","",1.11E-2,1.11E-2,0.28970000000000007,null,null,null,null,null,null,null,null,null,null,null,null,null,"","",null,"",""]
[null,"2020-10-01",1045,"2020-10-01",1045,null,null,null,"","",null,null,null,"","",null,null,null,"","",null,null,null,"","",null,"2016-11-10",4.071E-3,4.8789999999999997E-3,5.6810000000000003E-3,6.476E-3,{"$f":"+IF(AND(TRIM(AA258)=\"\",TRIM(AA257)<>\"\"),EDATE(AF257,1),IF(TRIM(AA258)=\"\",\"\",EOMONTH(AA258,-2)+1))","v":"2016-10-01"},4.071E-3,4.8789999999999997E-3,5.6810000000000003E-3,6.476E-3,null,"","",null,"2021-10-01","","","","",null,258,{"$error":"#REF!"},{"$error":"#REF!"},{"$error":"#REF!"},{"$error":"#REF!"},{"$error":"#REF!"},null,null,null,null,null,null,null,null,null,null,null,null,null,null,null,null,null,"2016-10-01",5.0000000000000001E-3,{"$f":"+IF(AND(TRIM(BR258)=\"\",TRIM(BR257)<>\"\"),\"\",IF(TRIM(BR258)=\"\",\"\",TRUNC(BR258,0)))","v":"2016-10-01"},5.0000000000000001E-3,null,"2016-10-01",1.0500000000000001E-2,"2016-10-01","2016-10-01",1.0500000000000001E-2,null,"2016-10-01","2016-10-01","","","",1.0500000000000001E-2,1.0500000000000001E-2,0.27920000000000006,null,null,null,null,null,null,null,null,null,null,null,null,null,"","",null,"",""]
[null,"2020-11-01",1045,"2020-11-01",1045,null,null,null,"","",null,null,null,"","",null,null,null,"","",null,null,null,"","",null,"2016-12-10",3.8969999999999999E-3,4.7060000000000001E-3,5.5069999999999997E-3,6.3020000000000003E-3,{"$f":"+IF(AND(TRIM(AA259)=\"\",TRIM(AA258)<>\"\"),EDATE(AF258,1),IF(TRIM(AA259)=\"\",\"\",EOMONTH(AA259,-2)+1))","v":"2016-11-01"},3.8969999999999999E-3,4.7060000000000001E-3,5.5069999999999997E-3,6.3020000000000003E-3,null,"","",null,"2021-11-01","","","","",null,259,{"$error":"#REF!"},{"$error":"#REF!"},{"$error":"#REF!"},{"$error":"#REF!"},{"$error":"#REF!"},null,null,null,null,null,null,null,null,null,null,null,null,null,null,null,null,null,"2016-11-01",5.0000000000000001E-3,"2016-11-01",5.0000000000000001E-3,null,"2016-11-01",1.04E-2,"2016-11-01","2016-11-01",1.04E-2,null,"2016-11-01","2016-11-01","","","",1.04E-2,1.04E-2,0.26880000000000004,null,null,null,null,null,null,null,null,null,null,null,null,null,"","",null,"",""]
[null,"2020-12-01",1045,"2020-12-01",1045,null,null,null,"","",null,null,null,"","",null,null,null,"","",null,null,null,"","",null,"2017-01-10",4.3189999999999999E-3,5.1279999999999997E-3,5.9300000000000004E-3,6.7250000000000001E-3,"2016-12-01",4.3189999999999999E-3,5.1279999999999997E-3,5.9300000000000004E-3,6.7250000000000001E-3,null,"","",null,"2021-12-01","","","","",null,260,{"$error":"#REF!"},{"$error":"#REF!"},{"$error":"#REF!"},{"$error":"#REF!"},{"$error":"#REF!"},null,null,null,null,null,null,null,null,null,null,null,null,null,null,null,null,null,"2016-12-01",5.0000000000000001E-3,"2016-12-01",5.0000000000000001E-3,null,"2016-12-01",1.12E-2,"2016-12-01","2016-12-01",1.12E-2,null,"2016-12-01","2016-12-01","","","",1.12E-2,1.12E-2,0.25760000000000005,null,null,null,null,null,null,null,null,null,null,null,null,null,"","",null,"",""]
[null,"2021-01-01",1100,"2021-01-01",1100,null,null,null,"","",null,null,null,"","",null,null,null,"","",null,null,null,"","",null,"2017-02-10",4.1700000000000001E-3,4.9789999999999999E-3,5.7809999999999997E-3,6.5750000000000001E-3,"2017-01-01",4.1700000000000001E-3,4.9789999999999999E-3,5.7809999999999997E-3,6.5750000000000001E-3,null,"","",null,"","","","","",null,261,{"$error":"#REF!"},{"$error":"#REF!"},{"$error":"#REF!"},{"$error":"#REF!"},{"$error":"#REF!"},null,null,null,null,null,null,null,null,null,null,null,null,null,null,null,null,null,"2017-01-01",5.0000000000000001E-3,"2017-01-01",5.0000000000000001E-3,null,"2017-01-01",1.09E-2,"2017-01-01","2017-01-01",1.09E-2,null,"2017-01-01","2017-01-01","","","",1.09E-2,1.09E-2,0.24670000000000003,null,null,null,null,null,null,null,null,null,null,null,null,null,"","",null,"",""]
[null,"2021-02-01",1100,"2021-02-01",1100,null,null,null,"","",null,null,null,"","",null,null,null,"","",null,null,null,"","",null,"2017-03-10",2.7690000000000002E-3,3.5760000000000002E-3,4.3769999999999998E-3,5.1710000000000002E-3,"2017-02-01",2.7690000000000002E-3,3.5760000000000002E-3,4.3769999999999998E-3,5.1710000000000002E-3,null,"","",null,"","","","","",null,262,{"$error":"#REF!"},{"$error":"#REF!"},{"$error":"#REF!"},{"$error":"#REF!"},{"$error":"#REF!"},null,null,null,null,null,null,null,null,null,null,null,null,null,null,null,null,null,"2017-02-01",5.0000000000000001E-3,"2017-02-01",{"$f":"IF(TRIM(BS262)=\"\",\"\",BS262)","v":5.0000000000000001E-3},null,"2017-02-01",8.6999999999999994E-3,"2017-02-01","2017-02-01",8.6999999999999994E-3,null,{"$f":"+IF(BT262=\"\",\"\",BT262)","v":"2017-02-01"},"2017-02-01","","","",8.6999999999999994E-3,8.6999999999999994E-3,0.23800000000000002,null,null,null,null,null,null,null,null,null,null,null,null,null,"","",null,"",""]
[null,"2021-03-01",1100,"2021-03-01",1100,null,null,null,"","",null,null,null,"","",null,null,null,"","",null,null,null,"","",null,"2017-04-10",3.9890000000000004E-3,4.797E-3,5.5989999999999998E-3,6.3930000000000002E-3,"2017-03-01",3.9890000000000004E-3,4.797E-3,5.5989999999999998E-3,6.3930000000000002E-3,null,"","",null,"","","","","",null,263,{"$error":"#REF!"},{"$error":"#REF!"},{"$error":"#REF!"},{"$error":"#REF!"},{"$error":"#REF!"},null,null,null,null,null,null,null,null,null,null,null,null,null,null,null,null,null,"2017-03-01",5.0000000000000001E-3,"2017-03-01",5.0000000000000001E-3,null,"2017-03-01",1.0500000000000001E-2,"2017-03-01","2017-03-01",1.0500000000000001E-2,null,"2017-03-01","2017-03-01","","","",1.0500000000000001E-2,1.0500000000000001E-2,0.22750000000000001,null,null,{"$f":"+IF(CP262=\"\",\"\",IF(CN262>=VDAT_AT1,0,CP262+IF(CQ263=\"\",0,CQ263)))","v":""},null,null,null,null,null,null,null,null,null,null,"","",null,"",""]
[null,"2021-04-01",1100,"2021-04-01",1100,null,null,null,"","",null,null,null,"","",null,null,null,"","",null,null,null,"","",null,"2017-05-10",2.4659999999999999E-3,3.2729999999999999E-3,4.0740000000000004E-3,4.8669999999999998E-3,"2017-04-01",2.4659999999999999E-3,3.2729999999999999E-3,4.0740000000000004E-3,4.8669999999999998E-3,null,"","",null,"","","","","",null,264,{"$error":"#REF!"},{"$error":"#REF!"},{"$error":"#REF!"},{"$error":"#REF!"},{"$error":"#REF!"},null,null,null,null,null,null,null,null,null,null,null,null,null,null,null,null,null,"2017-04-01",5.0000000000000001E-3,{"$f":"+IF(AND(TRIM(BR264)=\"\",TRIM(BR263)<>\"\"),\"\",IF(TRIM(BR264)=\"\",\"\",TRUNC(BR264,0)))","v":"2017-04-01"},5.0000000000000001E-3,null,"2017-04-01",7.9000000000000008E-3,"2017-04-01","2017-04-01",7.9000000000000008E-3,null,"2017-04-01","2017-04-01","","","",7.9000000000000008E-3,7.9000000000000008E-3,0.21960000000000002,null,null,null,null,null,null,null,null,null,null,null,null,null,"","",null,"",""]
[null,"2021-05-01",1100,"2021-05-01",1100,null,null,null,{"$f":"+IF(AND(TRIM(G265)=\"\",TRIM(G264)<>\"\"),EDATE(I264,1),IF(TRIM(G265)=\"\",\"\",TRUNC(G265,0)))","v":""},{"$f":"+IF(AND(H265=\"\",H264<>\"\"),0,IF(TRIM(H265)=\"\",\"\",H265))","v":""},null,null,null,"","",null,null,null,{"$f":"+IF(AND(TRIM(Q265)=\"\",TRIM(Q264)<>\"\"),EDATE(S264,1),IF(TRIM(Q265)=\"\",\"\",TRUNC(Q265,0)))","v":""},{"$f":"+IF(AND(R265=\"\",R264<>\"\"),0,IF(TRIM(R265)=\"\",\"\",R265))","v":""},null,null,null,{"$f":"+IF(AND(TRIM(V265)=\"\",TRIM(V264)<>\"\"),EDATE(X264,1),IF(TRIM(V265)=\"\",\"\",TRUNC(V265,0)))","v":""},{"$f":"+IF(AND(W265=\"\",W264<>\"\"),0,IF(TRIM(W265)=\"\",\"\",W265))","v":""},null,"2017-06-10",3.2320000000000001E-3,4.0400000000000002E-3,4.8409999999999998E-3,5.6350000000000003E-3,"2017-05-01",3.2320000000000001E-3,4.0400000000000002E-3,4.8409999999999998E-3,5.6350000000000003E-3,null,"","",null,"","","","","",null,265,{"$f":"IF(INDIRECT(CONCATENATE(VLET_DT,TEXT(AU265,\"#0\")))=\"\",\"\",INDIRECT(CONCATENATE(VLET_DT,TEXT(AU265,\"#0\"))))","v":{"$error":"#REF!"}},{"$f":"+IF(AV265=\"\",\"\",IF(AV265<=VDAT_AT,AV265,\"\"))","v":{"$error":"#REF!"}},{"$f":"IF(OR(AW265=\"\",INDIRECT(CONCATENATE(VLET_COT,TEXT(AU265,\"#0\")))=\"\"),\"\",IF(AW265=VDAT_AT,1+IF(COD_CM=4,0.01,0),INDIRECT(CONCATENATE(VLET_COT,TEXT(AU265,\"#0\")))))","v":{"$error":"#REF!"}},{"$f":"+IF(COD_CM=4,IF(AX265=\"\",\"\",AX265+IF(AY266=\"\",0,AY266)),IF(OR(AV265>VDAT_AT,AV265=\"\"),\"\",IF(AV265=VDAT_AT,1,IF(AY266=\"\",1,AY266)*(1+AX265)/AZ265)))","v":{"$error":"#REF!"}},{"$f":"+IF(AW265=\"\",\"\",LOOKUP(AW265,COL_DAT_CORTE,COL_VAL_CORTE))","v":{"$error":"#REF!"}},null,null,null,null,null,null,null,null,null,null,null,null,null,null,null,null,null,"2017-05-01",5.0000000000000001E-3,{"$f":"+IF(AND(TRIM(BR265)=\"\",TRIM(BR264)<>\"\"),\"\",IF(TRIM(BR265)=\"\",\"\",TRUNC(BR265,0)))","v":"2017-05-01"},5.0000000000000001E-3,null,"2017-05-01",9.2999999999999992E-3,{"$f":"+IF(AND(TRIM(BW265)=\"\",TRIM(BW264)<>\"\"),EDATE(BY264,1),IF(TRIM(BW265)=\"\",\"\",TRUNC(BW265,0)))","v":"2017-05-01"},{"$f":"+IF(BY265=\"\",\"\",IF(BY265<=VDAT_AT,BY265,\"\"))","v":"2017-05-01"},{"$f":"+IF(BY265>VDAT_AT,\"\",IF(AND(BZ265<>\"\",BZ266=\"\"),0.01,IF(TRIM(BX265)=\"\",\"\",BX265)))","v":9.2999999999999992E-3},null,"2017-05-01","2017-05-01",{"$f":"+IF(CC265=\"\",\"\",IF(COD_JUROS=1,0.5%,IF(COD_JUROS=4,1%,IF(COD_JUROS=11,0%,\"\"))))","v":""},{"$f":"+IF(OR(COD_JUROS<>2,CD265=\"\"),\"\",BU265)","v":""},"",{"$f":"+IF(OR(COD_JUROS<>10,CD265=\"\"),\"\",CA265)","v":9.2999999999999992E-3},9.2999999999999992E-3,{"$f":"+IF(CI265=\"\",\"\",IF(CD265=VDAT_AT1,0,CI266+IF(CJ266=\"\",0,CJ266)))","v":0.21030000000000001},null,null,null,null,null,null,null,null,null,null,null,null,null,"","",null,{"$f":"+S265","v":""},{"$f":"+IF(OR(T265=\"\",BU325=\"\"),\"\",((1+T265)*(1+BU325)-1))","v":""}]
[null,"2021-06-01",1100,{"$f":"+IF(TRIM(B266)=\"\",\"\",B266)","v":"2021-06-01"},1100,null,null,null,"","",null,null,null,"","",null,null,null,"","",null,null,null,"","",null,"2017-07-10",3.003E-3,3.8110000000000002E-3,4.6119999999999998E-3,5.4060000000000002E-3,"2017-06-01",3.003E-3,3.8110000000000002E-3,4.6119999999999998E-3,5.4060000000000002E-3,null,"","",null,"","","","","",null,266,{"$error":"#REF!"},{"$error":"#REF!"},{"$error":"#REF!"},{"$error":"#REF!"},{"$error":"#REF!"},null,null,null,null,null,null,null,null,null,null,null,null,null,null,null,null,null,"2017-06-01",5.0000000000000001E-3,"2017-06-01",5.0000000000000001E-3,null,"2017-06-01",8.0999999999999996E-3,"2017-06-01","2017-06-01",8.0999999999999996E-3,null,"2017-06-01",{"$f":"+IF(CD265=\"\",\"\",IF(EDATE(CD265,1)<=VDAT_AT1,EDATE(CD265,1),\"\"))","v":"2017-06-01"},"","","",8.0999999999999996E-3,{"$f":"+IF(CD266=\"\",\"\",SUM(CE266:CH266))","v":8.0999999999999996E-3},0.20220000000000002,null,null,null,null,null,null,null,null,null,null,null,null,null,"","",null,"",""]
[null,"2021-07-01",1100,"2021-07-01",1100,null,null,null,"","",null,null,null,"","",null,null,null,"","",null,null,null,"","",null,"2017-08-10",3.0899999999999999E-3,3.898E-3,4.6990000000000001E-3,5.4929999999999996E-3,"2017-07-01",{"$f":"IF(TRIM(AB267)=\"\",\"\",AB267)","v":3.0899999999999999E-3},{"$f":"IF(TRIM(AC267)=\"\",\"\",AC267)","v":3.898E-3},{"$f":"IF(TRIM(AD267)=\"\",\"\",AD267)","v":4.6990000000000001E-3},{"$f":"IF(TRIM(AE267)=\"\",\"\",AE267)","v":5.4929999999999996E-3},null,"","",null,"","","","","",null,267,{"$error":"#REF!"},{"$error":"#REF!"},{"$error":"#REF!"},{"$error":"#REF!"},{"$error":"#REF!"},null,null,null,null,null,null,null,null,null,null,null,null,null,null,null,null,null,"2017-07-01",5.0000000000000001E-3,"2017-07-01",5.0000000000000001E-3,null,"2017-07-01",8.0000000000000002E-3,"2017-07-01","2017-07-01",8.0000000000000002E-3,null,"2017-07-01","2017-07-01","","",{"$f":"+IF(OR(COD_JUROS<>3,CD266=\"\"),\"\",BU267)","v":""},8.0000000000000002E-3,8.0000000000000002E-3,0.19420000000000001,null,null,null,null,null,null,null,null,null,null,null,null,null,"","",null,"",""]
[null,"2021-08-01",1100,"2021-08-01",1100,null,null,null,"","",null,null,null,"","",null,null,null,"","",null,null,null,"","",null,"2017-09-10",2.9759999999999999E-3,3.784E-3,4.5849999999999997E-3,5.3790000000000001E-3,"2017-08-01",{"$f":"+IF(AND(AB268=\"\",AB267<>\"\"),0,IF(TRIM(AB268)=\"\",\"\",AB268))","v":2.9759999999999999E-3},{"$f":"+IF(AND(AC268=\"\",AC267<>\"\"),0,IF(TRIM(AC268)=\"\",\"\",AC268))","v":3.784E-3},{"$f":"+IF(AND(AD268=\"\",AD267<>\"\"),0,IF(TRIM(AD268)=\"\",\"\",AD268))","v":4.5849999999999997E-3},{"$f":"+IF(AND(AE268=\"\",AE267<>\"\"),0,IF(TRIM(AE268)=\"\",\"\",AE268))","v":5.3790000000000001E-3},null,"","",null,"","","","","",null,268,{"$error":"#REF!"},{"$error":"#REF!"},{"$error":"#REF!"},{"$error":"#REF!"},{"$error":"#REF!"},null,null,null,null,null,null,null,null,null,null,null,null,null,null,null,null,null,"2017-08-01",5.0000000000000001E-3,"2017-08-01",5.0000000000000001E-3,null,"2017-08-01",8.0000000000000002E-3,"2017-08-01","2017-08-01",8.0000000000000002E-3,null,"2017-08-01","2017-08-01","","","",8.0000000000000002E-3,8.0000000000000002E-3,0.1862,null,null,null,null,null,null,null,null,null,null,null,null,null,"","",null,"",""]
[null,"2021-09-01",1100,"2021-09-01",1100,null,null,null,"","",null,null,null,"","",null,null,null,"","",null,null,null,"","",null,"2017-10-10",2.4659999999999999E-3,3.2729999999999999E-3,4.0740000000000004E-3,4.8669999999999998E-3,"2017-09-01",2.4659999999999999E-3,3.2729999999999999E-3,4.0740000000000004E-3,4.8669999999999998E-3,null,"","",null,"","","","","",null,269,{"$error":"#REF!"},{"$error":"#REF!"},{"$error":"#REF!"},{"$error":"#REF!"},{"$error":"#REF!"},null,null,null,null,null,null,null,null,null,null,null,null,null,null,null,null,null,"2017-09-01",5.0000000000000001E-3,"2017-09-01",5.0000000000000001E-3,null,"2017-09-01",6.4000000000000003E-3,"2017-09-01","2017-09-01",6.4000000000000003E-3,null,"2017-09-01","2017-09-01","","","",6.4000000000000003E-3,6.4000000000000003E-3,0.17980000000000002,null,null,null,null,null,null,null,null,null,null,null,null,null,"","",null,"",""]
[null,"2021-10-01",1100,"2021-10-01",1100,null,null,null,"","",null,null,null,"","",null,null,null,"","",null,null,null,"","",null,"2017-11-10",2.4659999999999999E-3,3.2729999999999999E-3,4.0740000000000004E-3,4.8669999999999998E-3,"2017-10-01",2.4659999999999999E-3,3.2729999999999999E-3,4.0740000000000004E-3,4.8669999999999998E-3,null,"","",null,"","","","","",null,270,{"$error":"#REF!"},{"$error":"#REF!"},{"$error":"#REF!"},{"$error":"#REF!"},{"$error":"#REF!"},null,null,null,null,null,null,null,null,null,null,null,null,null,null,null,null,null,"2017-10-01",5.0000000000000001E-3,"2017-10-01",5.0000000000000001E-3,null,"2017-10-01",6.4000000000000003E-3,"2017-10-01","2017-10-01",6.4000000000000003E-3,null,"2017-10-01","2017-10-01","","","",6.4000000000000003E-3,6.4000000000000003E-3,0.17340000000000003,null,null,null,null,null,null,null,null,null,null,null,null,null,"","",null,"",""]
[null,"2021-11-01",1100,"2021-11-01",1100,null,null,null,"","",null,null,null,"","",null,null,null,"","",null,null,null,"","",null,"2017-12-10",2.4659999999999999E-3,3.2729999999999999E-3,4.0740000000000004E-3,4.8669999999999998E-3,"2017-11-01",2.4659999999999999E-3,3.2729999999999999E-3,4.0740000000000004E-3,4.8669999999999998E-3,null,{"$f":"+S271","v":""},{"$f":"+T271","v":""},null,"","","","","",null,271,{"$error":"#REF!"},{"$error":"#REF!"},{"$error":"#REF!"},{"$error":"#REF!"},{"$error":"#REF!"},null,null,null,null,null,null,null,null,null,null,null,null,null,null,null,null,null,"2017-11-01",4.6899999999999997E-3,"2017-11-01",4.6899999999999997E-3,null,"2017-11-01",5.7000000000000002E-3,"2017-11-01","2017-11-01",5.7000000000000002E-3,null,"2017-11-01","2017-11-01","","","",5.7000000000000002E-3,5.7000000000000002E-3,0.16770000000000002,null,null,null,null,null,null,null,null,null,null,null,null,null,"","",null,"",""]
[null,"2021-12-01",1100,"2021-12-01",1100,null,null,null,"","",null,null,null,"","",null,null,null,"","",null,null,null,"","",null,"2018-01-10",2.4659999999999999E-3,3.2729999999999999E-3,4.0740000000000004E-3,4.8669999999999998E-3,"2017-12-01",2.4659999999999999E-3,3.2729999999999999E-3,4.0740000000000004E-3,4.8669999999999998E-3,null,"","",null,"","","","","",null,272,{"$error":"#REF!"},{"$error":"#REF!"},{"$error":"#REF!"},{"$error":"#REF!"},{"$error":"#REF!"},null,null,null,null,null,null,null,null,null,null,null,null,null,null,null,null,null,"2017-12-01",4.2729999999999999E-3,"2017-12-01",4.2729999999999999E-3,null,"2017-12-01",5.4000000000000003E-3,"2017-12-01","2017-12-01",5.4000000000000003E-3,null,"2017-12-01","2017-12-01","","","",5.4000000000000003E-3,5.4000000000000003E-3,0.16230000000000003,null,null,null,null,null,null,null,null,null,null,null,null,null,"","",null,"",""]
[null,null,null,"","",null,null,null,"","",null,null,null,"","",null,null,null,"","",null,null,null,"","",null,"2018-02-10",2.4659999999999999E-3,3.2729999999999999E-3,4.0740000000000004E-3,4.8669999999999998E-3,"2018-01-01",2.4659999999999999E-3,3.2729999999999999E-3,4.0740000000000004E-3,4.8669999999999998E-3,null,"","",null,"","","","","",null,273,{"$error":"#REF!"},{"$error":"#REF!"},{"$error":"#REF!"},{"$error":"#REF!"},{"$error":"#REF!"},null,null,null,null,null,null,null,null,null,null,null,null,null,null,null,null,null,"2018-01-01",4.2729999999999999E-3,"2018-01-01",4.2729999999999999E-3,null,"2018-01-01",5.7999999999999996E-3,"2018-01-01","2018-01-01",5.7999999999999996E-3,null,"2018-01-01","2018-01-01","","","",5.7999999999999996E-3,5.7999999999999996E-3,0.15650000000000003,null,null,null,null,null,null,null,null,null,null,null,null,null,"","",null,"",""]
[null,null,null,"","",null,null,null,"","",null,null,null,"","",null,null,null,"","",null,null,null,"","",null,"2018-03-10",2.4659999999999999E-3,3.2729999999999999E-3,4.0740000000000004E-3,4.8669999999999998E-3,"2018-02-01",2.4659999999999999E-3,3.2729999999999999E-3,4.0740000000000004E-3,4.8669999999999998E-3,null,"","",null,"","","","","",null,274,{"$error":"#REF!"},{"$error":"#REF!"},{"$error":"#REF!"},{"$error":"#REF!"},{"$error":"#REF!"},null,null,null,null,null,null,null,null,null,null,null,null,null,null,null,null,null,"2018-02-01",3.9940000000000002E-3,"2018-02-01",3.9940000000000002E-3,null,"2018-02-01",4.7000000000000002E-3,"2018-02-01","2018-02-01",4.7000000000000002E-3,null,"2018-02-01","2018-02-01","","","",4.7000000000000002E-3,4.7000000000000002E-3,0.15180000000000002,null,null,null,null,null,null,null,null,null,null,null,null,null,"","",null,"",""]
[null,null,null,"","",null,null,null,"","",null,null,null,"","",null,null,null,"","",null,null,null,"","",null,"2018-04-10",2.4659999999999999E-3,3.2729999999999999E-3,4.0740000000000004E-3,4.8669999999999998E-3,"2018-03-01",2.4659999999999999E-3,3.2729999999999999E-3,4.0740000000000004E-3,4.8669999999999998E-3,null,"","",null,"","","","","",null,275,{"$error":"#REF!"},{"$error":"#REF!"},{"$error":"#REF!"},{"$error":"#REF!"},{"$error":"#REF!"},null,null,null,null,null,null,null,null,null,null,null,null,null,null,null,null,null,"2018-03-01",3.9940000000000002E-3,"2018-03-01",3.9940000000000002E-3,null,"2018-03-01",5.3E-3,"2018-03-01","2018-03-01",5.3E-3,null,"2018-03-01","2018-03-01","","","",5.3E-3,5.3E-3,0.14650000000000002,null,null,null,null,null,null,null,null,null,null,null,null,null,"","",null,"",""]
[null," ",null,"","",null,null,null,"","",null,null,null,"","",null,null,null,"","",null,null,null,"","",null,"2018-05-10",2.4659999999999999E-3,3.2729999999999999E-3,4.0740000000000004E-3,4.8669999999999998E-3,"2018-04-01",2.4659999999999999E-3,3.2729999999999999E-3,4.0740000000000004E-3,4.8669999999999998E-3,null,"","",null,"","","","","",null,276,{"$error":"#REF!"},{"$error":"#REF!"},{"$error":"#REF!"},{"$error":"#REF!"},{"$error":"#REF!"},null,null,null,null,null,null,null,null,null,null,null,null,null,null,null,null,null,"2018-04-01",3.8549999999999999E-3,"2018-04-01",3.8549999999999999E-3,null,"2018-04-01",5.1999999999999998E-3,"2018-04-01","2018-04-01",5.1999999999999998E-3,null,"2018-04-01","2018-04-01","","","",5.1999999999999998E-3,5.1999999999999998E-3,0.14130000000000001,null,null,null,null,null,null,null,null,null,null,null,null,null,{"$f":"+I276","v":""},{"$f":"+J276","v":""},null,"",""]
[null,null,null,"","",null,null,null,"","",null,null,null,"","",null,null,null,"","",null,null,null,"","",null,"2018-06-10",2.4659999999999999E-3,3.2729999999999999E-3,4.0740000000000004E-3,4.8669999999999998E-3,"2018-05-01",2.4659999999999999E-3,3.2729999999999999E-3,4.0740000000000004E-3,4.8669999999999998E-3,null,"","",null,{"$f":"IF(AO276=\"\",\"\",IF(EDATE(AO276,1)>VMES99,\"\",EDATE(AO276,1)))","v":""},{"$f":"+IF(DB277=\"\",\"\",0.002466)","v":""},{"$f":"+IF(DB277=\"\",\"\",0.003273)","v":""},{"$f":"+IF(DB277=\"\",\"\",0.004074)","v":""},{"$f":"+IF(DB277=\"\",\"\",0.004867)","v":""},null,277,{"$error":"#REF!"},{"$error":"#REF!"},{"$error":"#REF!"},{"$error":"#REF!"},{"$error":"#REF!"},null,null,null,null,null,null,null,null,null,null,null,null,null,null,null,null,null,"2018-05-01",3.715E-3,"2018-05-01",3.715E-3,null,"2018-05-01",5.1999999999999998E-3,"2018-05-01","2018-05-01",5.1999999999999998E-3,null,"2018-05-01","2018-05-01","","","",5.1999999999999998E-3,5.1999999999999998E-3,0.1361,null,null,null,null,null,null,null,null,null,null,null,null,null,"","",null,"",""]
[null,null,null,"","",null,null,null,"","",null,null,null,"","",null,null,null,"","",null,null,null,"","",null,"2018-07-10",2.4659999999999999E-3,3.2729999999999999E-3,4.0740000000000004E-3,4.8669999999999998E-3,"2018-06-01",2.4659999999999999E-3,3.2729999999999999E-3,4.0740000000000004E-3,4.8669999999999998E-3,null,"","",null,"","","","","",null,278,{"$error":"#REF!"},{"$error":"#REF!"},{"$error":"#REF!"},{"$error":"#REF!"},{"$error":"#REF!"},null,null,null,null,null,null,null,null,null,null,null,null,null,null,null,null,null,"2018-06-01",3.715E-3,"2018-06-01",3.715E-3,null,"2018-06-01",5.1999999999999998E-3,"2018-06-01","2018-06-01",5.1999999999999998E-3,null,"2018-06-01","2018-06-01","","","",5.1999999999999998E-3,5.1999999999999998E-3,0.13089999999999999,null,null,null,null,null,null,null,null,null,null,null,null,null,"","",null,"",""]
[null,null,null,"","",null,null,null,"","",null,null,null,"","",null,null,null,"","",null,null,null,"","",null,"2018-08-10",2.4659999999999999E-3,3.2729999999999999E-3,4.0740000000000004E-3,4.8669999999999998E-3,"2018-07-01",2.4659999999999999E-3,3.2729999999999999E-3,4.0740000000000004E-3,4.8669999999999998E-3,null,"","",null,"","","","","",null,279,{"$error":"#REF!"},{"$error":"#REF!"},{"$error":"#REF!"},{"$error":"#REF!"},{"$error":"#REF!"},null,null,null,null,null,null,null,null,null,null,null,null,null,null,null,null,null,"2018-07-01",3.715E-3,"2018-07-01",3.715E-3,null,"2018-07-01",5.4000000000000003E-3,"2018-07-01","2018-07-01",5.4000000000000003E-3,null,"2018-07-01","2018-07-01","","","",5.4000000000000003E-3,5.4000000000000003E-3,0.1255,null,null,null,null,null,null,null,null,null,null,null,null,null,"","",null,"",""]
[null,null,null,"","",null,null,null,"","",null,null,null,"","",null,null,null,"","",null,null,null,"","",null,"2018-09-10",2.4659999999999999E-3,3.2729999999999999E-3,4.0740000000000004E-3,4.8669999999999998E-3,"2018-08-01",2.4659999999999999E-3,3.2729999999999999E-3,4.0740000000000004E-3,4.8669999999999998E-3,null,"","",null,"","","","","",null,280,{"$error":"#REF!"},{"$error":"#REF!"},{"$error":"#REF!"},{"$error":"#REF!"},{"$error":"#REF!"},null,null,null,null,null,null,null,null,null,null,null,null,null,null,null,null,null,"2018-08-01",3.715E-3,"2018-08-01",3.715E-3,null,"2018-08-01",5.7000000000000002E-3,"2018-08-01","2018-08-01",5.7000000000000002E-3,null,"2018-08-01","2018-08-01","","","",5.7000000000000002E-3,5.7000000000000002E-3,0.11979999999999999,null,null,null,null,null,null,null,null,null,null,null,null,null,"","",null,"",""]
[null,null,null,"","",null,null,null,"","",null,null,null,"","",null,null,null,"","",null,null,null,"","",null,"2018-10-10",2.4659999999999999E-3,3.2729999999999999E-3,4.0740000000000004E-3,4.8669999999999998E-3,"2018-09-01",2.4659999999999999E-3,3.2729999999999999E-3,4.0740000000000004E-3,4.8669999999999998E-3,null,"","",null,"","","","","",null,281,{"$error":"#REF!"},{"$error":"#REF!"},{"$error":"#REF!"},{"$error":"#REF!"},{"$error":"#REF!"},null,null,null,null,null,null,null,null,null,null,null,null,null,null,null,null,null,"2018-09-01",3.715E-3,"2018-09-01",3.715E-3,null,"2018-09-01",4.7000000000000002E-3,"2018-09-01","2018-09-01",4.7000000000000002E-3,null,"2018-09-01","2018-09-01","","","",4.7000000000000002E-3,4.7000000000000002E-3,0.11509999999999999,null,null,null,null,null,null,null,null,null,null,null,null,null,"","",null,"",""]
[null,null,null,"","",null,null,null,"","",null,null,null,"","",null,null,null,"","",null,null,null,"","",null,"2018-11-10",2.4659999999999999E-3,3.2729999999999999E-3,4.0740000000000004E-3,4.8669999999999998E-3,"2018-10-01",{"$f":"+IF(AND(AB282=\"\",AB281<>\"\"),0,IF(TRIM(AB282)=\"\",\"\",AB282))","v":2.4659999999999999E-3},{"$f":"+IF(AND(AC282=\"\",AC281<>\"\"),0,IF(TRIM(AC282)=\"\",\"\",AC282))","v":3.2729999999999999E-3},{"$f":"+IF(AND(AD282=\"\",AD281<>\"\"),0,IF(TRIM(AD282)=\"\",\"\",AD282))","v":4.0740000000000004E-3},4.8669999999999998E-3,null,"","",null,"","","","","",null,282,{"$error":"#REF!"},{"$error":"#REF!"},{"$error":"#REF!"},{"$error":"#REF!"},{"$error":"#REF!"},null,null,null,null,null,null,null,null,null,null,null,null,null,null,null,null,null,"2018-10-01",3.715E-3,"2018-10-01",3.715E-3,null,"2018-10-01",5.4000000000000003E-3,"2018-10-01","2018-10-01",5.4000000000000003E-3,null,"2018-10-01","2018-10-01","","","",5.4000000000000003E-3,5.4000000000000003E-3,0.10969999999999999,null,null,null,null,null,null,null,null,null,null,null,null,null,"","",null,"",""]
[null,null,null,"","",null,null,null,"","",null,null,null,"","",null,null,null,"","",null,null,null,"","",null,"2018-12-10",2.4659999999999999E-3,3.2729999999999999E-3,4.0740000000000004E-3,4.8669999999999998E-3,"2018-11-01",{"$f":"+IF(AND(AB283=\"\",AB282<>\"\"),0,IF(TRIM(AB283)=\"\",\"\",AB283))","v":2.4659999999999999E-3},{"$f":"+IF(AND(AC283=\"\",AC282<>\"\"),0,IF(TRIM(AC283)=\"\",\"\",AC283))","v":3.2729999999999999E-3},{"$f":"+IF(AND(AD283=\"\",AD282<>\"\"),0,IF(TRIM(AD283)=\"\",\"\",AD283))","v":4.0740000000000004E-3},{"$f":"+IF(AND(AE283=\"\",AE282<>\"\"),0,IF(TRIM(AE283)=\"\",\"\",AE283))","v":4.8669999999999998E-3},null,"","",null,"","","","","",null,283,{"$error":"#REF!"},{"$error":"#REF!"},{"$error":"#REF!"},{"$error":"#REF!"},{"$error":"#REF!"},null,null,null,null,null,null,null,null,null,null,null,null,null,null,null,null,null,"2018-11-01",3.715E-3,"2018-11-01",3.715E-3,null,"2018-11-01",4.8999999999999998E-3,"2018-11-01","2018-11-01",4.8999999999999998E-3,null,"2018-11-01","2018-11-01","","","",4.8999999999999998E-3,4.8999999999999998E-3,0.10479999999999999,null,null,null,null,null,null,null,null,null,null,null,null,null,"","",null,"",""]
[null,null,null,"","",null,null,null,"","",null,null,null,"","",null,null,null,"","",null,null,null,"","",null,"2019-01-10",2.4659999999999999E-3,3.2729999999999999E-3,4.0740000000000004E-3,4.8669999999999998E-3,"2018-12-01",2.4659999999999999E-3,3.2729999999999999E-3,4.0740000000000004E-3,4.8669999999999998E-3,null,"","",null,"","","","","",null,284,{"$error":"#REF!"},{"$error":"#REF!"},{"$error":"#REF!"},{"$error":"#REF!"},{"$error":"#REF!"},null,null,null,null,null,null,null,null,null,null,null,null,null,null,null,null,null,"2018-12-01",3.715E-3,"2018-12-01",3.715E-3,null,"2018-12-01",4.8999999999999998E-3,"2018-12-01","2018-12-01",4.8999999999999998E-3,null,"2018-12-01","2018-12-01","","","",4.8999999999999998E-3,4.8999999999999998E-3,9.9899999999999989E-2,null,null,null,null,null,null,null,null,null,null,null,null,null,"","",null,"",""]
[null,null,null,"","",null,null,null,"","",null,null,null,"","",null,null,null,"","",null,null,null,"","",null,"2019-02-10",2.4659999999999999E-3,3.2729999999999999E-3,4.0740000000000004E-3,4.8669999999999998E-3,"2019-01-01",2.4659999999999999E-3,3.2729999999999999E-3,4.0740000000000004E-3,4.8669999999999998E-3,null,"","",null,"","","","","",null,285,{"$error":"#REF!"},{"$error":"#REF!"},{"$error":"#REF!"},{"$error":"#REF!"},{"$error":"#REF!"},null,null,null,null,null,null,null,null,null,null,null,null,null,null,null,null,null,"2019-01-01",3.715E-3,"2019-01-01",3.715E-3,null,"2019-01-01",5.4000000000000003E-3,"2019-01-01","2019-01-01",5.4000000000000003E-3,null,"2019-01-01","2019-01-01","","","",5.4000000000000003E-3,5.4000000000000003E-3,9.4499999999999987E-2,null,null,null,null,null,null,null,null,null,null,null,null,null,"","",null,"",""]
[null,null,null,"","",null,null,null,"","",null,null,null,"",{"$f":"+IF(AND(M286=\"\",M285<>\"\"),0,IF(TRIM(M286)=\"\",\"\",M286))","v":""},null,null,null,"","",null,null,null,"","",null,"2019-03-10",2.4659999999999999E-3,3.2729999999999999E-3,4.0740000000000004E-3,4.8669999999999998E-3,"2019-02-01",2.4659999999999999E-3,3.2729999999999999E-3,4.0740000000000004E-3,4.8669999999999998E-3,null,"","",null,"","","","","",null,286,{"$error":"#REF!"},{"$error":"#REF!"},{"$error":"#REF!"},{"$error":"#REF!"},{"$error":"#REF!"},null,null,null,null,null,null,null,null,null,null,null,null,null,null,null,null,null,"2019-02-01",3.715E-3,"2019-02-01",3.715E-3,null,"2019-02-01",4.8999999999999998E-3,"2019-02-01","2019-02-01",4.8999999999999998E-3,null,"2019-02-01","2019-02-01","","","",4.8999999999999998E-3,4.8999999999999998E-3,8.9599999999999985E-2,null,null,null,null,null,null,null,null,null,null,null,null,null,"","",null,"",""]
[null,null,null,"","",null,null,null,"","",null,null,null,"","",null,null,null,"","",null,null,null,"","",null,"2019-04-10",2.4659999999999999E-3,3.2729999999999999E-3,4.0740000000000004E-3,4.8669999999999998E-3,"2019-03-01",2.4659999999999999E-3,3.2729999999999999E-3,4.0740000000000004E-3,4.8669999999999998E-3,null,"","",null,"","","","","",null,287,{"$error":"#REF!"},{"$error":"#REF!"},{"$error":"#REF!"},{"$error":"#REF!"},{"$error":"#REF!"},null,null,null,null,null,null,null,null,null,null,null,null,null,null,null,null,null,"2019-03-01",3.715E-3,"2019-03-01",3.715E-3,null,"2019-03-01",4.7000000000000002E-3,"2019-03-01","2019-03-01",4.7000000000000002E-3,null,"2019-03-01","2019-03-01","","","",4.7000000000000002E-3,4.7000000000000002E-3,8.4899999999999989E-2,null,null,null,null,null,null,null,null,null,null,null,null,null,"","",null,"",""]
[null,null,null,"","",null,null,null,"","",null,null,null,"","",null,null,null,"","",null,null,null,"","",null,"2019-05-10",2.4659999999999999E-3,3.2729999999999999E-3,4.0740000000000004E-3,4.8669999999999998E-3,"2019-04-01",2.4659999999999999E-3,3.2729999999999999E-3,4.0740000000000004E-3,4.8669999999999998E-3,null,"","",null,"","","","","",null,288,{"$error":"#REF!"},{"$error":"#REF!"},{"$error":"#REF!"},{"$error":"#REF!"},{"$error":"#REF!"},null,null,null,null,null,null,null,null,null,null,null,null,null,null,null,null,null,"2019-04-01",3.715E-3,"2019-04-01",3.715E-3,null,"2019-04-01",5.1999999999999998E-3,"2019-04-01","2019-04-01",5.1999999999999998E-3,null,"2019-04-01","2019-04-01","","","",5.1999999999999998E-3,5.1999999999999998E-3,7.9699999999999993E-2,null,null,null,null,null,null,null,null,null,null,null,null,null,"","",null,"",""]
[null,null,null,"","",null,null,null,"","",null,null,null,"","",null,null,null,"","",null,null,null,"","",null,"2019-06-10",2.4659999999999999E-3,3.2729999999999999E-3,4.0740000000000004E-3,4.8669999999999998E-3,"2019-05-01",2.4659999999999999E-3,3.2729999999999999E-3,4.0740000000000004E-3,4.8669999999999998E-3,null,"","",null,"","","","","",null,289,{"$error":"#REF!"},{"$error":"#REF!"},{"$error":"#REF!"},{"$error":"#REF!"},{"$error":"#REF!"},null,null,null,null,null,null,null,null,null,null,null,null,null,null,null,null,null,"2019-05-01",3.715E-3,"2019-05-01",3.715E-3,null,"2019-05-01",5.4000000000000003E-3,"2019-05-01","2019-05-01",5.4000000000000003E-3,null,"2019-05-01","2019-05-01","","","",5.4000000000000003E-3,5.4000000000000003E-3,7.4299999999999991E-2,null,null,null,null,null,null,null,null,null,null,null,null,null,"","",null,"",""]
[null,null,null,"","",null,null,null,"","",null,null,null,"","",null,null,null,"","",null,null,null,"","",null,"2019-07-10",2.4659999999999999E-3,3.2729999999999999E-3,4.0740000000000004E-3,4.8669999999999998E-3,"2019-06-01",2.4659999999999999E-3,3.2729999999999999E-3,4.0740000000000004E-3,4.8669999999999998E-3,null,"","",null,"","","","","",null,290,{"$error":"#REF!"},{"$error":"#REF!"},{"$error":"#REF!"},{"$error":"#REF!"},{"$error":"#REF!"},null,null,null,null,null,null,null,null,null,null,null,null,null,null,null,null,null,"2019-06-01",3.715E-3,"2019-06-01",3.715E-3,null,"2019-06-01",4.7000000000000002E-3,"2019-06-01","2019-06-01",4.7000000000000002E-3,null,"2019-06-01","2019-06-01","","","",4.7000000000000002E-3,4.7000000000000002E-3,6.9599999999999995E-2,null,null,null,null,null,null,null,null,null,null,null,null,null,"","",null,"",""]
[null,null,null,"","",null,null,null,"","",null,null,null,"","",null,null,null,"","",null,null,null,"","",null,"2019-08-10",2.4659999999999999E-3,3.2729999999999999E-3,4.0740000000000004E-3,4.8669999999999998E-3,"2019-07-01",2.4659999999999999E-3,3.2729999999999999E-3,4.0740000000000004E-3,4.8669999999999998E-3,null,"","",null,"","","","","",null,291,{"$error":"#REF!"},{"$error":"#REF!"},{"$error":"#REF!"},{"$error":"#REF!"},{"$error":"#REF!"},null,null,null,null,null,null,null,null,null,null,null,null,null,null,null,null,null,"2019-07-01",3.715E-3,"2019-07-01",3.715E-3,null,"2019-07-01",5.7000000000000002E-3,"2019-07-01","2019-07-01",5.7000000000000002E-3,null,"2019-07-01","2019-07-01","","","",5.7000000000000002E-3,5.7000000000000002E-3,6.3899999999999998E-2,null,null,null,null,null,null,null,null,null,null,null,null,null,"","",null,"",""]
[null,null,null,"","",null,null,null,"","",null,null,null,"","",null,null,null,"","",null,null,null,"","",null,"2019-09-10",2.4659999999999999E-3,3.2729999999999999E-3,4.0740000000000004E-3,4.8669999999999998E-3,"2019-08-01",2.4659999999999999E-3,3.2729999999999999E-3,4.0740000000000004E-3,4.8669999999999998E-3,null,"","",null,"","","","","",null,292,{"$error":"#REF!"},{"$error":"#REF!"},{"$error":"#REF!"},{"$error":"#REF!"},{"$error":"#REF!"},null,null,null,null,null,null,null,null,null,null,null,null,null,null,null,null,null,"2019-08-01",3.715E-3,"2019-08-01",3.715E-3,null,"2019-08-01",5.0000000000000001E-3,"2019-08-01","2019-08-01",5.0000000000000001E-3,null,"2019-08-01","2019-08-01","","","",5.0000000000000001E-3,5.0000000000000001E-3,5.8899999999999994E-2,null,null,null,null,null,null,null,null,null,null,null,null,null,"","",null,"",""]
[null,null,null,"","",null,null,null,"","",null,null,null,"","",null,null,null,"","",null,null,null,"","",null,"2019-10-10",2.4659999999999999E-3,3.2729999999999999E-3,4.0740000000000004E-3,4.8669999999999998E-3,"2019-09-01",2.4659999999999999E-3,3.2729999999999999E-3,4.0740000000000004E-3,4.8669999999999998E-3,null,{"$f":"+S293","v":""},{"$f":"+T293","v":""},null,"","","","","",null,293,{"$error":"#REF!"},{"$error":"#REF!"},{"$error":"#REF!"},{"$error":"#REF!"},{"$error":"#REF!"},null,null,null,null,null,null,null,null,null,null,null,null,null,null,null,null,null,"2019-09-01",3.434E-3,"2019-09-01",3.434E-3,null,"2019-09-01",4.5999999999999999E-3,"2019-09-01","2019-09-01",4.5999999999999999E-3,null,"2019-09-01","2019-09-01","","","",4.5999999999999999E-3,4.5999999999999999E-3,5.4299999999999994E-2,null,null,null,null,null,null,null,null,null,null,null,null,null,"","",null,"",""]
[null,null,null,"","",null,null,null,"","",null,null,null,"","",null,null,null,"","",null,null,null,"","",null,"2019-11-10",2.4659999999999999E-3,3.2729999999999999E-3,4.0740000000000004E-3,4.8669999999999998E-3,"2019-10-01",2.4659999999999999E-3,3.2729999999999999E-3,4.0740000000000004E-3,4.8669999999999998E-3,null,"","",null,"","","","","",null,294,{"$error":"#REF!"},{"$error":"#REF!"},{"$error":"#REF!"},{"$error":"#REF!"},{"$error":"#REF!"},null,null,null,null,null,null,null,null,null,null,null,null,null,null,null,null,null,"2019-10-01",3.434E-3,"2019-10-01",3.434E-3,null,"2019-10-01",4.7999999999999996E-3,"2019-10-01","2019-10-01",4.7999999999999996E-3,null,"2019-10-01","2019-10-01","","","",4.7999999999999996E-3,4.7999999999999996E-3,4.9499999999999995E-2,null,null,null,null,null,null,null,null,null,null,null,null,null,"","",null,"",""]
[null,null,null,"","",null,null,null,"","",null,null,null,"","",null,null,null,"","",null,null,null,"","",null,"2019-12-10",2.4659999999999999E-3,3.2729999999999999E-3,4.0740000000000004E-3,4.8669999999999998E-3,"2019-11-01",2.4659999999999999E-3,3.2729999999999999E-3,4.0740000000000004E-3,4.8669999999999998E-3,null,"","",null,"","","","","",null,295,{"$error":"#REF!"},{"$error":"#REF!"},{"$error":"#REF!"},{"$error":"#REF!"},{"$error":"#REF!"},null,null,null,null,null,null,null,null,null,null,null,null,null,null,null,null,null,"2019-11-01",3.153E-3,"2019-11-01",3.153E-3,null,"2019-11-01",3.8E-3,"2019-11-01","2019-11-01",3.8E-3,null,"2019-11-01","2019-11-01","","","",3.8E-3,3.8E-3,4.5699999999999998E-2,null,null,null,null,null,null,null,null,null,null,null,null,null,"","",null,"",""]
[null,null,null,"","",null,null,null,"","",null,null,null,"","",null,null,null,"","",null,null,null,"","",null,"2020-01-10",2.4659999999999999E-3,3.2729999999999999E-3,4.0740000000000004E-3,4.8669999999999998E-3,"2019-12-01",2.4659999999999999E-3,3.2729999999999999E-3,4.0740000000000004E-3,4.8669999999999998E-3,null,"","",null,"","","","","",null,296,{"$error":"#REF!"},{"$error":"#REF!"},{"$error":"#REF!"},{"$error":"#REF!"},{"$error":"#REF!"},null,null,null,null,null,null,null,null,null,null,null,null,null,null,null,null,null,"2019-12-01",2.8709999999999999E-3,"2019-12-01",2.8709999999999999E-3,null,"2019-12-01",3.7000000000000002E-3,"2019-12-01","2019-12-01",3.7000000000000002E-3,null,"2019-12-01","2019-12-01","","","",3.7000000000000002E-3,3.7000000000000002E-3,4.1999999999999996E-2,null,null,null,null,null,null,null,null,null,null,null,null,null,"","",null,"",""]
[null,null,null,{"$f":"+IF(TRIM(B297)=\"\",\"\",B297)","v":""},{"$f":"+IF(TRIM(C297)=\"\",\"\",C297)","v":""},null,null,null,{"$f":"+IF(AND(TRIM(G297)=\"\",TRIM(G296)<>\"\"),EDATE(I296,1),IF(TRIM(G297)=\"\",\"\",TRUNC(G297,0)))","v":""},{"$f":"+IF(AND(H297=\"\",H296<>\"\"),0,IF(TRIM(H297)=\"\",\"\",H297))","v":""},null,null,null,"","",null,null,null,"","",null,null,null,"","",null,"2020-02-10",2.4659999999999999E-3,3.2729999999999999E-3,4.0740000000000004E-3,4.8669999999999998E-3,"2020-01-01",2.4659999999999999E-3,3.2729999999999999E-3,4.0740000000000004E-3,4.8669999999999998E-3,null,"","",null,"","","","","",null,297,{"$error":"#REF!"},{"$error":"#REF!"},{"$error":"#REF!"},{"$error":"#REF!"},{"$error":"#REF!"},null,null,null,null,null,null,null,null,null,null,null,null,null,null,null,null,null,"2020-01-01",2.8709999999999999E-3,"2020-01-01",2.8709999999999999E-3,null,"2020-01-01",3.8E-3,"2020-01-01","2020-01-01",3.8E-3,null,"2020-01-01","2020-01-01","","","",3.8E-3,3.8E-3,3.8199999999999998E-2,null,null,null,null,null,null,null,null,null,null,null,null,null,"","",null,"",""]
[null,null,null,"","",null,null,null,"","",null,null,null,"","",null,null,null,"","",null,null,null,"","",null,"2020-03-10",2.4659999999999999E-3,3.2729999999999999E-3,4.0740000000000004E-3,4.8669999999999998E-3,"2020-02-01",2.4659999999999999E-3,3.2729999999999999E-3,4.0740000000000004E-3,4.8669999999999998E-3,null,"","",null,"","","","","",null,298,{"$error":"#REF!"},{"$error":"#REF!"},{"$error":"#REF!"},{"$error":"#REF!"},{"$error":"#REF!"},null,null,null,null,null,null,null,null,null,null,null,null,null,null,null,null,null,"2020-02-01",2.588E-3,"2020-02-01",2.588E-3,null,"2020-02-01",2.8999999999999998E-3,"2020-02-01","2020-02-01",2.8999999999999998E-3,null,"2020-02-01","2020-02-01","","","",2.8999999999999998E-3,2.8999999999999998E-3,3.5299999999999998E-2,null,null,null,null,null,null,null,null,null,null,null,null,null,"","",null,"",""]
[null,null,null,"","",null,null,null,"","",null,null,null,"","",null,null,null,"","",null,null,null,"","",null,"2020-04-10",2.4659999999999999E-3,3.2729999999999999E-3,4.0740000000000004E-3,4.8669999999999998E-3,"2020-03-01",2.4659999999999999E-3,3.2729999999999999E-3,4.0740000000000004E-3,4.8669999999999998E-3,null,"","",null,"","","","","",null,299,{"$error":"#REF!"},{"$error":"#REF!"},{"$error":"#REF!"},{"$error":"#REF!"},{"$error":"#REF!"},null,null,null,null,null,null,null,null,null,null,null,null,null,null,null,null,null,"2020-03-01",2.588E-3,"2020-03-01",2.588E-3,null,"2020-03-01",3.3999999999999998E-3,"2020-03-01","2020-03-01",3.3999999999999998E-3,null,"2020-03-01","2020-03-01","","",{"$f":"+IF(OR(COD_JUROS<>3,CD298=\"\"),\"\",BU299)","v":""},3.3999999999999998E-3,3.3999999999999998E-3,3.1899999999999998E-2,null,null,null,null,null,null,null,null,null,null,null,null,null,"","",null,"",""]
[null,null,null,"","",null,null,null,"","",null,null,null,"","",null,null,null,{"$f":"+IF(AND(TRIM(Q300)=\"\",TRIM(Q299)<>\"\"),EDATE(S299,1),IF(TRIM(Q300)=\"\",\"\",TRUNC(Q300,0)))","v":""},{"$f":"+IF(AND(R300=\"\",R299<>\"\"),0,IF(TRIM(R300)=\"\",\"\",R300))","v":""},null,null,null,{"$f":"+IF(AND(TRIM(V300)=\"\",TRIM(V299)<>\"\"),EDATE(X299,1),IF(TRIM(V300)=\"\",\"\",TRUNC(V300,0)))","v":""},{"$f":"+IF(AND(W300=\"\",W299<>\"\"),0,IF(TRIM(W300)=\"\",\"\",W300))","v":""},null,"2020-05-10",2.4659999999999999E-3,3.2729999999999999E-3,4.0740000000000004E-3,4.8669999999999998E-3,"2020-04-01",2.4659999999999999E-3,3.2729999999999999E-3,4.0740000000000004E-3,4.8669999999999998E-3,null,"","",null,"","","","","",null,300,{"$error":"#REF!"},{"$error":"#REF!"},{"$error":"#REF!"},{"$error":"#REF!"},{"$error":"#REF!"},null,null,null,null,null,null,null,null,null,null,null,null,null,null,null,null,null,"2020-04-01",2.4659999999999999E-3,"2020-04-01",2.4659999999999999E-3,null,"2020-04-01",2.8E-3,{"$f":"+IF(AND(TRIM(BW300)=\"\",TRIM(BW299)<>\"\"),EDATE(BY299,1),IF(TRIM(BW300)=\"\",\"\",TRUNC(BW300,0)))","v":"2020-04-01"},{"$f":"+IF(BY300=\"\",\"\",IF(BY300<=VDAT_AT,BY300,\"\"))","v":"2020-04-01"},{"$f":"+IF(BY300>VDAT_AT,\"\",IF(AND(BZ300<>\"\",BZ301=\"\"),0.01,IF(TRIM(BX300)=\"\",\"\",BX300)))","v":2.8E-3},null,"2020-04-01","2020-04-01","","","",2.8E-3,2.8E-3,2.9100000000000001E-2,null,null,null,null,null,null,null,null,null,null,null,null,null,"","",null,"",""]
[null,null,null,"","",null,null,null,"","",null,null,null,"","",null,null,null,"","",null,null,null,"","",null,"2020-06-10",2.4659999999999999E-3,3.2729999999999999E-3,4.0740000000000004E-3,4.8669999999999998E-3,"2020-05-01",2.4659999999999999E-3,3.2729999999999999E-3,4.0740000000000004E-3,4.8669999999999998E-3,null,"","",null,"","","","","",null,301,{"$f":"IF(INDIRECT(CONCATENATE(VLET_DT,TEXT(AU301,\"#0\")))=\"\",\"\",INDIRECT(CONCATENATE(VLET_DT,TEXT(AU301,\"#0\"))))","v":{"$error":"#REF!"}},{"$f":"+IF(AV301=\"\",\"\",IF(AV301<=VDAT_AT,AV301,\"\"))","v":{"$error":"#REF!"}},{"$f":"IF(OR(AW301=\"\",INDIRECT(CONCATENATE(VLET_COT,TEXT(AU301,\"#0\")))=\"\"),\"\",IF(AW301=VDAT_AT,1+IF(COD_CM=4,0.01,0),INDIRECT(CONCATENATE(VLET_COT,TEXT(AU301,\"#0\")))))","v":{"$error":"#REF!"}},{"$error":"#REF!"},{"$error":"#REF!"},null,null,null,null,null,null,null,null,null,null,null,null,null,null,null,null,null,"2020-05-01",2.1619999999999999E-3,"2020-05-01",2.1619999999999999E-3,null,"2020-05-01",2.3999999999999998E-3,"2020-05-01","2020-05-01",2.3999999999999998E-3,null,"2020-05-01","2020-05-01","","","",2.3999999999999998E-3,2.3999999999999998E-3,2.6700000000000002E-2,null,null,null,null,null,null,null,null,null,null,null,null,null,null,null,null,"",""]
[null,null,null,"","",null,null,null,"","",null,null,null,"","",null,null,null,"","",null,null,null,"","",null,"2020-07-10",2.4659999999999999E-3,3.2729999999999999E-3,4.0740000000000004E-3,4.8669999999999998E-3,"2020-06-01",2.4659999999999999E-3,3.2729999999999999E-3,4.0740000000000004E-3,4.8669999999999998E-3,null,"","",null,"","","","","",null,302,{"$error":"#REF!"},{"$error":"#REF!"},{"$error":"#REF!"},{"$error":"#REF!"},{"$error":"#REF!"},null,null,null,null,null,null,null,null,null,null,null,null,null,null,null,null,null,"2020-06-01",2.1619999999999999E-3,"2020-06-01",2.1619999999999999E-3,null,"2020-06-01",2.0999999999999999E-3,"2020-06-01","2020-06-01",2.0999999999999999E-3,null,"2020-06-01","2020-06-01","","","",2.0999999999999999E-3,2.0999999999999999E-3,2.46E-2,null,null,null,null,null,null,null,null,null,null,null,null,null,null,null,null,"",""]
[null,null,null,"","",null,null,null,"","",null,null,null,"","",null,null,null,"","",null,null,null,"","",null,"2020-08-10",2.4659999999999999E-3,3.2729999999999999E-3,4.0740000000000004E-3,4.8669999999999998E-3,"2020-07-01",2.4659999999999999E-3,3.2729999999999999E-3,4.0740000000000004E-3,4.8669999999999998E-3,null,"","",null,"","","","","",null,303,{"$error":"#REF!"},{"$error":"#REF!"},{"$error":"#REF!"},{"$error":"#REF!"},{"$error":"#REF!"},null,null,null,null,null,null,null,null,null,null,null,null,null,null,null,null,null,"2020-07-01",1.7329999999999999E-3,"2020-07-01",1.7329999999999999E-3,null,"2020-07-01",1.9E-3,"2020-07-01","2020-07-01",1.9E-3,null,"2020-07-01","2020-07-01","","","",1.9E-3,1.9E-3,2.2700000000000001E-2,null,null,null,null,null,null,null,null,null,null,null,null,null,null,null,null,"",""]
[null,null,null,"","",null,null,null,"","",null,null,null,"","",null,null,null,"","",null,null,null,"","",null,"2020-09-10",2.4659999999999999E-3,3.2729999999999999E-3,4.0740000000000004E-3,4.8669999999999998E-3,"2020-08-01",2.4659999999999999E-3,3.2729999999999999E-3,4.0740000000000004E-3,4.8669999999999998E-3,null,"","",null,"","","","","",null,304,{"$error":"#REF!"},{"$error":"#REF!"},{"$error":"#REF!"},{"$error":"#REF!"},{"$error":"#REF!"},null,null,null,null,null,null,null,null,null,null,null,null,null,null,null,null,null,"2020-08-01",1.3029999999999999E-3,"2020-08-01",1.3029999999999999E-3,null,"2020-08-01",1.6000000000000001E-3,"2020-08-01","2020-08-01",1.6000000000000001E-3,null,"2020-08-01","2020-08-01","","","",1.6000000000000001E-3,1.6000000000000001E-3,2.1100000000000001E-2,null,null,null,null,null,null,null,null,null,null,null,null,null,null,null,null,"",""]
[null,null,null,"","",null,null,null,"","",null,null,null,"","",null,null,null,"","",null,null,null,"","",null,"2020-10-10",2.4659999999999999E-3,3.2729999999999999E-3,4.0740000000000004E-3,4.8669999999999998E-3,"2020-09-01",2.4659999999999999E-3,3.2729999999999999E-3,4.0740000000000004E-3,4.8669999999999998E-3,null,"","",null,"","","","","",null,305,{"$error":"#REF!"},{"$error":"#REF!"},{"$error":"#REF!"},{"$error":"#REF!"},{"$error":"#REF!"},null,null,null,null,null,null,null,null,null,null,null,null,null,null,null,null,null,"2020-09-01",1.3029999999999999E-3,"2020-09-01",1.3029999999999999E-3,null,"2020-09-01",1.6000000000000001E-3,"2020-09-01","2020-09-01",1.6000000000000001E-3,null,"2020-09-01","2020-09-01","","","",1.6000000000000001E-3,1.6000000000000001E-3,1.95E-2,null,null,null,null,null,null,null,null,null,null,null,null,null,null,null,null,"",""]
[null,null,null,"","",null,null,null,"","",null,null,null,"","",null,null,null,"","",null,null,null,"","",null,"2020-11-10",2.4659999999999999E-3,3.2729999999999999E-3,4.0740000000000004E-3,4.8669999999999998E-3,"2020-10-01",2.4659999999999999E-3,3.2729999999999999E-3,4.0740000000000004E-3,4.8669999999999998E-3,null,"","",null,"","","","","",null,306,{"$error":"#REF!"},{"$error":"#REF!"},{"$error":"#REF!"},{"$error":"#REF!"},{"$error":"#REF!"},null,null,null,null,null,null,null,null,null,null,null,null,null,null,null,null,null,"2020-10-01",1.1590000000000001E-3,"2020-10-01",1.1590000000000001E-3,null,"2020-10-01",1.6000000000000001E-3,"2020-10-01","2020-10-01",1.6000000000000001E-3,null,"2020-10-01","2020-10-01","","","",1.6000000000000001E-3,1.6000000000000001E-3,1.7899999999999999E-2,null,null,null,null,null,null,null,null,null,null,null,null,null,null,null,null,"",""]
[null,null,null,"","",null,null,null,"","",null,null,null,{"$f":"+IF(AND(M307=\"\",M306<>\"\"),EDATE(N306,1),IF(TRIM(L307)=\"\",\"\",TRUNC(L307,0)))","v":""},"",null,null,null,"","",null,null,null,"","",null,"2020-12-10",2.4659999999999999E-3,3.2729999999999999E-3,4.0740000000000004E-3,4.8669999999999998E-3,"2020-11-01",2.4659999999999999E-3,3.2729999999999999E-3,4.0740000000000004E-3,4.8669999999999998E-3,null,"","",null,"","","","","",null,307,{"$error":"#REF!"},{"$error":"#REF!"},{"$error":"#REF!"},{"$error":"#REF!"},{"$error":"#REF!"},null,null,null,null,null,null,null,null,null,null,null,null,null,null,null,null,null,"2020-11-01",1.1590000000000001E-3,"2020-11-01",1.1590000000000001E-3,null,"2020-11-01",1.5E-3,"2020-11-01","2020-11-01",1.5E-3,null,"2020-11-01","2020-11-01","","","",1.5E-3,1.5E-3,1.6399999999999998E-2,null,null,null,null,null,null,null,null,null,null,null,null,null,null,null,null,"",""]
[null,null,null,"","",null,null,null,"","",null,null,null,"","",null,null,null,"","",null,null,null,"","",null,"2021-01-10",2.4659999999999999E-3,3.2729999999999999E-3,4.0740000000000004E-3,4.8669999999999998E-3,"2020-12-01",2.4659999999999999E-3,3.2729999999999999E-3,4.0740000000000004E-3,4.8669999999999998E-3,null,"","",null,"","","","","",null,308,{"$error":"#REF!"},{"$error":"#REF!"},{"$error":"#REF!"},{"$error":"#REF!"},{"$error":"#REF!"},null,null,null,null,null,null,null,null,null,null,null,null,null,null,null,null,null,"2020-12-01",1.1590000000000001E-3,"2020-12-01",1.1590000000000001E-3,null,"2020-12-01",1.6000000000000001E-3,"2020-12-01","2020-12-01",1.6000000000000001E-3,null,"2020-12-01","2020-12-01","","","",1.6000000000000001E-3,1.6000000000000001E-3,1.4799999999999999E-2,null,null,null,null,null,null,null,null,null,null,null,null,null,null,null,null,"",""]
[null,null,null,"","",null,null,null,"","",null,null,null,"","",null,null,null,"","",null,null,null,"","",null,"2021-02-10",2.4659999999999999E-3,3.2729999999999999E-3,4.0740000000000004E-3,4.8669999999999998E-3,{"$f":"+IF(AND(TRIM(AA309)=\"\",TRIM(AA308)<>\"\"),EDATE(AF308,1),IF(TRIM(AA309)=\"\",\"\",EOMONTH(AA309,-2)+1))","v":"2021-01-01"},2.4659999999999999E-3,3.2729999999999999E-3,4.0740000000000004E-3,4.8669999999999998E-3,null,"","",null,{"$f":"IF(AO308=\"\",\"\",IF(EDATE(AO308,1)>VMES99,\"\",EDATE(AO308,1)))","v":""},{"$f":"+IF(DB309=\"\",\"\",0.002466)","v":""},{"$f":"+IF(DB309=\"\",\"\",0.003273)","v":""},{"$f":"+IF(DB309=\"\",\"\",0.004074)","v":""},{"$f":"+IF(DB309=\"\",\"\",0.004867)","v":""},null,309,{"$error":"#REF!"},{"$error":"#REF!"},{"$error":"#REF!"},{"$error":"#REF!"},{"$error":"#REF!"},null,null,null,null,null,null,null,null,null,null,null,null,null,null,null,null,null,"2021-01-01",1.1590000000000001E-3,"2021-01-01",1.1590000000000001E-3,null,"2021-01-01",1.5E-3,"2021-01-01","2021-01-01",1.5E-3,null,"2021-01-01","2021-01-01","","","",1.5E-3,1.5E-3,1.3299999999999999E-2,null,null,null,null,null,null,null,null,null,null,null,null,null,null,null,null,"",""]
[null,null,null,"","",null,null,null,"","",null,null,null,"","",null,null,null,"","",null,null,null,"","",null,"2021-03-10",2.4659999999999999E-3,3.2729999999999999E-3,4.0740000000000004E-3,4.8669999999999998E-3,"2021-02-01",2.4659999999999999E-3,3.2729999999999999E-3,4.0740000000000004E-3,4.8669999999999998E-3,null,"","",null,"","","","","",null,310,{"$error":"#REF!"},{"$error":"#REF!"},{"$error":"#REF!"},{"$error":"#REF!"},{"$error":"#REF!"},null,null,null,null,null,null,null,null,null,null,null,null,null,null,null,null,null,"2021-02-01",1.1590000000000001E-3,"2021-02-01",1.1590000000000001E-3,null,"2021-02-01",1.2999999999999999E-3,"2021-02-01","2021-02-01",1.2999999999999999E-3,null,"2021-02-01","2021-02-01","","","",1.2999999999999999E-3,1.2999999999999999E-3,1.2E-2,null,null,null,null,null,null,null,null,null,null,null,null,null,null,null,null,"",""]
[null,null,null,"","",null,null,null,"","",null,null,null,"","",null,null,null,"","",null,null,null,"","",null,"2021-04-10",2.4659999999999999E-3,3.2729999999999999E-3,4.0740000000000004E-3,4.8669999999999998E-3,"2021-03-01",2.4659999999999999E-3,3.2729999999999999E-3,4.0740000000000004E-3,4.8669999999999998E-3,null,"","",null,"","","","","",null,311,{"$error":"#REF!"},{"$error":"#REF!"},{"$error":"#REF!"},{"$error":"#REF!"},{"$error":"#REF!"},null,null,null,null,null,null,null,null,null,null,null,null,null,null,null,null,null,"2021-03-01",1.1590000000000001E-3,"2021-03-01",1.1590000000000001E-3,null,"2021-03-01",2E-3,"2021-03-01","2021-03-01",2E-3,null,"2021-03-01","2021-03-01","","","",2E-3,2E-3,0.01,null,null,null,null,null,null,null,null,null,null,null,null,null,null,null,null,"",""]
[null,null,null,"","",null,null,null,"","",null,null,null,"","",null,null,null,"","",null,null,null,"","",null,null,null,null,null,null,"2021-04-01",0,0,0,0,null,"","",null,"","","","","",null,312,{"$error":"#REF!"},{"$error":"#REF!"},{"$error":"#REF!"},{"$error":"#REF!"},{"$error":"#REF!"},null,null,null,null,null,null,null,null,null,null,null,null,null,null,null,null,null,"2021-04-01",1.1590000000000001E-3,"2021-04-01",1.1590000000000001E-3,null,null,null,"2021-04-01","2021-04-01",0.01,null,"2021-04-01","2021-04-01","","","",0.01,0.01,0,null,null,null,null,null,null,null,null,null,null,null,null,null,null,null,null,"",""]
[null,null,null,"","",null,null,null,"","",null,null,null,"","",null,null,null,"","",null,null,null,"","",null,null,null,null,null,null,"","","","","",null,"","",null,"","","","","",null,313,{"$error":"#REF!"},{"$error":"#REF!"},{"$error":"#REF!"},{"$error":"#REF!"},{"$error":"#REF!"},null,null,null,null,null,null,null,null,null,null,null,null,null,null,null,null,null,null,null,"","",null,null,null,{"$f":"+IF(AND(TRIM(BW313)=\"\",TRIM(BW312)<>\"\"),EDATE(BY312,1),IF(TRIM(BW313)=\"\",\"\",TRUNC(BW313,0)))","v":""},{"$f":"+IF(BY313=\"\",\"\",IF(BY313<=VDAT_AT,BY313,\"\"))","v":""},{"$f":"+IF(BY313>VDAT_AT,\"\",IF(AND(BZ313<>\"\",BZ314=\"\"),0.01,IF(TRIM(BX313)=\"\",\"\",BX313)))","v":""},null,"","2021-05-01","","","","",0,0,null,null,null,null,null,null,null,null,null,null,null,null,null,null,null,null,"",""]
[null,null,null,"","",null,null,null,"","",null,null,null,"","",null,null,null,"","",null,null,null,"","",null,null,null,null,null,null,"","","","","",null,"","",null,"","","","","",null,314,{"$error":"#REF!"},{"$error":"#REF!"},{"$error":"#REF!"},{"$error":"#REF!"},{"$error":"#REF!"},null,null,null,null,null,null,null,null,null,null,null,null,null,null,null,null,null,null,null,"","",null,null,null,"","","",null,"","2021-06-01","","","","",0,0,null,null,null,null,null,null,null,null,null,null,null,null,null,null,null,null,"",""]
[null,null,null,"","",null,null,null,"","",null,null,null,"","",null,null,null,"","",null,null,null,"","",null,null,null,null,null,null,"","","","","",null,"","",null,"","","","","",null,315,{"$f":"IF(INDIRECT(CONCATENATE(VLET_DT,TEXT(AU315,\"#0\")))=\"\",\"\",INDIRECT(CONCATENATE(VLET_DT,TEXT(AU315,\"#0\"))))","v":{"$error":"#REF!"}},{"$f":"+IF(AV315=\"\",\"\",IF(AV315<=VDAT_AT,AV315,\"\"))","v":{"$error":"#REF!"}},{"$f":"IF(OR(AW315=\"\",INDIRECT(CONCATENATE(VLET_COT,TEXT(AU315,\"#0\")))=\"\"),\"\",IF(AW315=VDAT_AT,1+IF(COD_CM=4,0.01,0),INDIRECT(CONCATENATE(VLET_COT,TEXT(AU315,\"#0\")))))","v":{"$error":"#REF!"}},{"$error":"#REF!"},{"$error":"#REF!"},null,null,null,null,null,null,null,null,null,null,null,null,null,null,null,null,null,null,null,"","",null,null,null,"","","",null,"","2021-07-01","","","","",0,0,null,null,null,null,null,null,null,null,null,null,null,null,null,null,null,null,"",""]
[null,null,null,"","",null,null,null,"","",null,null,null,"","",null,null,null,"","",null,null,null,"","",null,null,null,null,null,null,"","","","","",null,"","",null,"","","","","",null,316,{"$error":"#REF!"},{"$error":"#REF!"},{"$error":"#REF!"},{"$error":"#REF!"},{"$error":"#REF!"},null,null,null,null,null,null,null,null,null,null,null,null,null,null,null,null,null,null,null,"","",null,null,null,"","","",null,"","2021-08-01","","","","",0,0,null,null,null,null,null,null,null,null,null,null,null,null,null,null,null,null,"",""]
[null,null,null,"","",null,null,null,"","",null,null,null,"","",null,null,null,"","",null,null,null,"","",null,null,null,null,null,null,"","","","","",null,"","",null,"","","","","",null,317,{"$error":"#REF!"},{"$error":"#REF!"},{"$error":"#REF!"},{"$error":"#REF!"},{"$error":"#REF!"},null,null,null,null,null,null,null,null,null,null,null,null,null,null,null,null,null,null,null,"","",null,null,null,"","","",null,"","2021-09-01","","","","",0,0,null,null,null,null,null,null,null,null,null,null,null,null,null,null,null,null,"",""]
[null,null,null,"","",null,null,null,"","",null,null,null,"","",null,null,null,"","",null,null,null,"","",null,null,null,null,null,null,"","","","","",null,"","",null,"","","","","",null,318,{"$error":"#REF!"},{"$error":"#REF!"},{"$error":"#REF!"},{"$error":"#REF!"},{"$error":"#REF!"},null,null,null,null,null,null,null,null,null,null,null,null,null,null,null,null,null,null,null,"","",null,null,null,"","","",null,"","2021-10-01","","","","",0,0,null,null,null,null,null,null,null,null,null,null,null,null,null,null,null,null,"",""]
[null,null,null,"","",null,null,null,"","",null,null,null,"","",null,null,null,"","",null,null,null,"","",null,null,null,null,null,null,"","","","","",null,"","",null,"","","","","",null,319,{"$error":"#REF!"},{"$error":"#REF!"},{"$error":"#REF!"},{"$error":"#REF!"},{"$error":"#REF!"},null,null,null,null,null,null,null,null,null,null,null,null,null,null,null,null,null,null,null,"","",null,null,null,"","","",null,"","2021-11-01","","","","",0,0,null,null,null,null,null,null,null,null,null,null,null,null,null,null,null,null,"",""]
[null,null,null,"","",null,null,null,"","",null,null,null,"","",null,null,null,"","",null,null,null,"","",null,null,null,null,null,null,"","","","","",null,"","",null,"","","","","",null,320,{"$error":"#REF!"},{"$error":"#REF!"},{"$error":"#REF!"},{"$error":"#REF!"},{"$error":"#REF!"},null,null,null,null,null,null,null,null,null,null,null,null,null,null,null,null,null,null,null,"","",null,null,null,"","","",null,"","2021-12-01","","","","",0,0,null,null,null,null,null,null,null,null,null,null,null,null,null,null,null,null,"",""]
[null,null,null,"","",null,null,null,"","",null,null,null,"","",null,null,null,"","",null,null,null,"","",null,null,null,null,null,null,"","","","","",null,"","",null,"","","","","",null,321,{"$error":"#REF!"},{"$error":"#REF!"},{"$error":"#REF!"},{"$error":"#REF!"},{"$error":"#REF!"},null,null,null,null,null,null,null,null,null,null,null,null,null,null,null,null,null,null,null,"","",null,null,null,"","","",null,"","","","","","","","",null,null,null,null,null,null,null,null,null,null,null,null,null,null,null,null,"",""]
[null,null,null,"","",null,null,null,"","",null,null,null,"","",null,null,null,"","",null,null,null,"","",null,null,null,null,null,null,"","","","","",null,"","",null,"","","","","",null,322,{"$error":"#REF!"},{"$error":"#REF!"},{"$error":"#REF!"},{"$error":"#REF!"},{"$error":"#REF!"},null,null,null,null,null,null,null,null,null,null,null,null,null,null,null,null,null,null,null,"","",null,null,null,"","","",null,"","","","","","","","",null,null,null,null,null,null,null,null,null,null,null,null,null,null,null,null,"",""]
[null,null,null,"","",null,null,null,"","",null,null,null,"","",null,null,null,"","",null,null,null,"","",null,null,null,null,null,null,"","","","","",null,"","",null,"","","","","",null,323,{"$error":"#REF!"},{"$error":"#REF!"},{"$error":"#REF!"},{"$error":"#REF!"},{"$error":"#REF!"},null,null,null,null,null,null,null,null,null,null,null,null,null,null,null,null,null,null,null,"","",null,null,null,"","","",null,"","","","","","","","",null,null,null,null,null,null,null,null,null,null,null,null,null,null,null,null,"",""]
[null,null,null,"","",null,null,null,"","",null,null,null,"","",null,null,null,"","",null,null,null,"","",null,null,null,null,null,null,"","","","","",null,"","",null,"","","","","",null,324,{"$error":"#REF!"},{"$error":"#REF!"},{"$error":"#REF!"},{"$error":"#REF!"},{"$error":"#REF!"},null,null,null,null,null,null,null,null,null,null,null,null,null,null,null,null,null,null,null,"","",null,null,null,"","","",null,"","","","","","","","",null,null,null,null,null,null,null,null,null,null,null,null,null,null,null,null,"",""]
[null,null,null,"","",null,null,null,"","",null,null,null,"","",null,null,null,"","",null,null,null,"","",null,null,null,null,null,null,"","","","","",null,"","",null,"","","","","",null,325,{"$error":"#REF!"},{"$error":"#REF!"},{"$error":"#REF!"},{"$error":"#REF!"},{"$error":"#REF!"},null,null,null,null,null,null,null,null,null,null,null,null,null,null,null,null,null,null,null,"","",null,null,null,"","","",null,"","","","","","","","",null,null,null,null,null,null,null,null,null,null,null,null,null,null,null,null,"",""]
[null,null,null,"","",null,null,null,"","",null,null,null,"","",null,null,null,"","",null,null,null,"","",null,null,null,null,null,null,"","","","","",null,"","",null,"","","","","",null,326,{"$error":"#REF!"},{"$error":"#REF!"},{"$error":"#REF!"},{"$error":"#REF!"},{"$error":"#REF!"},null,null,null,null,null,null,null,null,null,null,null,null,null,null,null,null,null,null,null,"",{"$f":"IF(TRIM(BS326)=\"\",\"\",BS326)","v":""},null,null,null,"","","",null,{"$f":"+IF(BT326=\"\",\"\",BT326)","v":""},"","","","","","","",null,null,null,null,null,null,null,null,null,null,null,null,null,null,null,null,"",""]
[null,null,null,null,null,null,null,null,null,null,null,null,null,null,null,null,null,null,null,null,null,null,null,null,null,null,null,null,null,null,null,null,null,null,null,null,null,null,null,null,null,null,null,null,null,null,327,{"$error":"#REF!"},{"$error":"#REF!"},{"$error":"#REF!"},{"$error":"#REF!"},{"$error":"#REF!"},null,null,null,null,null,null,null,null,null,null,null,null,null,null,null,null,null,null,null,"","",null,null,null,"","","",null,"","","","","","","",""]
[null,null,null,null,null,null,null,null,null,null,null,null,null,null,null,null,null,null,null,null,null,null,null,null,null,null,null,null,null,null,null,null,null,null,null,null,null,null,null,null,null,null,null,null,null,null,328,{"$error":"#REF!"},{"$error":"#REF!"},{"$error":"#REF!"},{"$error":"#REF!"},{"$error":"#REF!"},null,null,null,null,null,null,null,null,null,null,null,null,null,null,null,null,null,null,null,"","",null,null,null,"","","",null,"","","","","","","",""]
[null,null,null,null,null,null,null,null,null,null,null,null,null,null,null,null,null,null,null,null,null,null,null,null,null,null,null,null,null,null,null,null,null,null,null,null,null,null,null,null,null,null,null,null,null,null,329,{"$error":"#REF!"},{"$error":"#REF!"},{"$error":"#REF!"},{"$f":"+IF(COD_CM=4,IF(AX329=\"\",\"\",AX329+IF(AY330=\"\",0,AY330)),IF(OR(AV329>VDAT_AT,AV329=\"\"),\"\",IF(AV329=VDAT_AT,1,IF(AY330=\"\",1,AY330)*(1+AX329)/AZ329)))","v":{"$error":"#REF!"}},{"$f":"+IF(AW329=\"\",\"\",LOOKUP(AW329,COL_DAT_CORTE,COL_VAL_CORTE))","v":{"$error":"#REF!"}},null,null,null,null,null,null,null,null,null,null,null,null,null,null,null,null,null,null,null,{"$f":"+IF(AND(TRIM(BR329)=\"\",TRIM(BR328)<>\"\"),\"\",IF(TRIM(BR329)=\"\",\"\",TRUNC(BR329,0)))","v":""},"",null,null,null,"","","",null,"","",{"$f":"+IF(CC329=\"\",\"\",IF(COD_JUROS=1,0.5%,IF(COD_JUROS=4,1%,IF(COD_JUROS=11,0%,\"\"))))","v":""},{"$f":"+IF(OR(COD_JUROS<>2,CD329=\"\"),\"\",BU329)","v":""},"",{"$f":"+IF(OR(COD_JUROS<>10,CD329=\"\"),\"\",CA329)","v":""},"",{"$f":"+IF(CI329=\"\",\"\",IF(CD329=VDAT_AT1,0,CI330+IF(CJ330=\"\",0,CJ330)))","v":""}]
[null,null,null,null,null,null,null,null,null,null,null,null,null,null,null,null,null,null,null,null,null,null,null,null,null,null,null,null,null,null,null,null,null,null,null,null,null,null,null,null,null,null,null,null,null,null,330,{"$error":"#REF!"},{"$error":"#REF!"},{"$error":"#REF!"},{"$error":"#REF!"},{"$error":"#REF!"},null,null,null,null,null,null,null,null,null,null,null,null,null,null,null,null,null,null,null,"","",null,null,null,"","","",null,"",{"$f":"+IF(CD329=\"\",\"\",IF(EDATE(CD329,1)<=VDAT_AT1,EDATE(CD329,1),\"\"))","v":""},"","","","",{"$f":"+IF(CD330=\"\",\"\",SUM(CE330:CH330))","v":""},""]
[null,null,null,null,null,null,null,null,null,null,null,null,null,null,null,null,null,null,null,null,null,null,null,null,null,null,null,null,null,null,null,null,null,null,null,null,null,null,null,null,null,null,null,null,null,null,331,{"$error":"#REF!"},{"$error":"#REF!"},{"$error":"#REF!"},{"$error":"#REF!"},{"$error":"#REF!"},null,null,null,null,null,null,null,null,null,null,null,null,null,null,null,null,null,null,null,"","",null,null,null,"","","",null,"","","","",{"$f":"+IF(OR(COD_JUROS<>3,CD330=\"\"),\"\",BU331)","v":""},"","",""]
[null,null,null,null,null,null,null,null,null,null,null,null,null,null,null,null,null,null,null,null,null,null,null,null,null,null,null,null,null,null,null,null,null,null,null,null,null,null,null,null,null,null,null,null,null,null,332,{"$error":"#REF!"},{"$error":"#REF!"},{"$error":"#REF!"},{"$error":"#REF!"},{"$error":"#REF!"},null,null,null,null,null,null,null,null,null,null,null,null,null,null,null,null,null,null,null,"","",null,null,null,"","","",null,"","","","","","","",""]
[null,null,null,null,null,null,null,null,null,null,null,null,null,null,null,null,null,null,null,null,null,null,null,null,null,null,null,null,null,null,null,null,null,null,null,null,null,null,null,null,null,null,null,null,null,null,333,{"$error":"#REF!"},{"$error":"#REF!"},{"$error":"#REF!"},{"$error":"#REF!"},{"$error":"#REF!"},null,null,null,null,null,null,null,null,null,null,null,null,null,null,null,null,null,null,null,"","",null,null,null,{"$f":"+IF(AND(TRIM(BW333)=\"\",TRIM(BW332)<>\"\"),EDATE(BY332,1),IF(TRIM(BW333)=\"\",\"\",TRUNC(BW333,0)))","v":""},{"$f":"+IF(BY333=\"\",\"\",IF(BY333<=VDAT_AT,BY333,\"\"))","v":""},{"$f":"+IF(BY333>VDAT_AT,\"\",IF(AND(BZ333<>\"\",BZ334=\"\"),0.01,IF(TRIM(BX333)=\"\",\"\",BX333)))","v":""},null,"","","","","","","",""]
[null,null,null,null,null,null,null,null,null,null,null,null,null,null,null,null,null,null,null,null,null,null,null,null,null,null,null,null,null,null,null,null,null,null,null,null,null,null,null,null,null,null,null,null,null,null,334,{"$error":"#REF!"},{"$error":"#REF!"},{"$error":"#REF!"},{"$error":"#REF!"},{"$error":"#REF!"},null,null,null,null,null,null,null,null,null,null,null,null,null,null,null,null,null,null,null,"","",null,null,null,"","","",null,"","","","","","","",""]
[null,null,null,null,null,null,null,null,null,null,null,null,null,null,null,null,null,null,null,null,null,null,null,null,null,null,null,null,null,null,null,null,null,null,null,null,null,null,null,null,null,null,null,null,null,null,335,{"$error":"#REF!"},{"$error":"#REF!"},{"$error":"#REF!"},{"$error":"#REF!"},{"$error":"#REF!"},null,null,null,null,null,null,null,null,null,null,null,null,null,null,null,null,null,null,null,"","",null,null,null,"","","",null,"","","","","","","",""]
[null,null,null,null,null,null,null,null,null,null,null,null,null,null,null,null,null,null,null,null,null,null,null,null,null,null,null,null,null,null,null,null,null,null,null,null,null,null,null,null,null,null,null,null,null,null,336,{"$error":"#REF!"},{"$error":"#REF!"},{"$error":"#REF!"},{"$error":"#REF!"},{"$error":"#REF!"},null,null,null,null,null,null,null,null,null,null,null,null,null,null,null,null,null,null,null,"","",null,null,null,"","","",null,"","","","","","","",""]
[null,null,null,null,null,null,null,null,null,null,null,null,null,null,null,null,null,null,null,null,null,null,null,null,null,null,null,null,null,null,null,null,null,null,null,null,null,null,null,null,null,null,null,null,null,null,337,{"$error":"#REF!"},{"$error":"#REF!"},{"$error":"#REF!"},{"$error":"#REF!"},{"$error":"#REF!"},null,null,null,null,null,null,null,null,null,null,null,null,null,null,null,null,null,null,null,"","",null,null,null,"","","",null,"","","","","","","",""]
[null,null,null,null,null,null,null,null,null,null,null,null,null,null,null,null,null,null,null,null,null,null,null,null,null,null,null,null,null,null,null,null,null,null,null,null,null,null,null,null,null,null,null,null,null,null,338,{"$error":"#REF!"},{"$error":"#REF!"},{"$error":"#REF!"},{"$error":"#REF!"},{"$error":"#REF!"},null,null,null,null,null,null,null,null,null,null,null,null,null,null,null,null,null,null,null,"","",null,null,null,"","","",null,"","","","","","","",""]
[null,null,null,null,null,null,null,null,null,null,null,null,null,null,null,null,null,null,null,null,null,null,null,null,null,null,null,null,null,null,null,null,null,null,null,null,null,null,null,null,null,null,null,null,null,null,339,{"$error":"#REF!"},{"$error":"#REF!"},{"$error":"#REF!"},{"$error":"#REF!"},{"$error":"#REF!"},null,null,null,null,null,null,null,null,null,null,null,null,null,null,null,null,null,null,null,"","",null,null,null,"","","",null,"","","","","","","",""]
[null,null,null,null,null,null,null,null,null,null,null,null,null,null,null,null,null,null,null,null,null,null,null,null,null,null,null,null,null,null,null,null,null,null,null,null,null,null,null,null,null,null,null,null,null,null,340,{"$error":"#REF!"},{"$error":"#REF!"},{"$error":"#REF!"},{"$error":"#REF!"},{"$error":"#REF!"},null,null,null,null,null,null,null,null,null,null,null,null,null,null,null,null,null,null,null,"","",null,null,null,"","","",null,"","","","","","","",""]
[null,null,null,null,null,null,null,null,null,null,null,null,null,null,null,null,null,null,null,null,null,null,null,null,null,null,null,null,null,null,null,null,null,null,null,null,null,null,null,null,null,null,null,null,null,null,341,{"$error":"#REF!"},{"$error":"#REF!"},{"$error":"#REF!"},{"$error":"#REF!"},{"$error":"#REF!"},null,null,null,null,null,null,null,null,null,null,null,null,null,null,null,null,null,null,null,"","",null,null,null,"","","",null,"","","","","","","",""]
[null,null,null,null,null,null,null,null,null,null,null,null,null,null,null,null,null,null,null,null,null,null,null,null,null,null,null,null,null,null,null,null,null,null,null,null,null,null,null,null,null,null,null,null,null,null,342,{"$error":"#REF!"},{"$error":"#REF!"},{"$error":"#REF!"},{"$error":"#REF!"},{"$error":"#REF!"},null,null,null,{"$f":"+VDAT_AT","v":"2021-12-01"},null,null,null,null,null,null,null,null,null,null,null,null,null,null,null,"","",null,null,null,"","","",null,"","","","","","","",""]
[null,null,null,null,null,null,null,null,null,null,null,null,null,null,null,null,null,null,null,null,null,null,null,null,null,null,null,null,null,null,null,null,null,null,null,null,null,null,null,null,null,null,null,null,null,null,343,{"$error":"#REF!"},{"$error":"#REF!"},{"$error":"#REF!"},{"$error":"#REF!"},{"$error":"#REF!"},null,null,null,null,null,null,null,null,null,null,null,null,null,null,null,null,null,null,null,"","",null,null,null,"","","",null,"","","","","","","",""]
[null,null,null,null,null,null,null,null,null,null,null,null,null,null,null,null,null,null,null,null,null,null,null,null,null,null,null,null,null,null,null,null,null,null,null,null,null,null,null,null,null,null,null,null,null,null,344,{"$error":"#REF!"},{"$error":"#REF!"},{"$error":"#REF!"},{"$error":"#REF!"},{"$error":"#REF!"},null,null,null,null,null,null,null,null,null,null,null,null,null,null,null,null,null,null,null,"","",null,null,null,"","","",null,"","","","","","","",""]
[null,null,null,null,null,null,null,null,null,null,null,null,null,null,null,null,null,null,null,null,null,null,null,null,null,null,null,null,null,null,null,null,null,null,null,null,null,null,null,null,null,null,null,null,null,null,345,{"$error":"#REF!"},{"$error":"#REF!"},{"$error":"#REF!"},{"$error":"#REF!"},{"$error":"#REF!"},null,null,null,null,null,null,null,null,null,null,null,null,null,null,null,null,null,null,null,"",{"$f":"IF(TRIM(BS345)=\"\",\"\",BS345)","v":""},null,null,null,"","","",null,"","","","","","","",""]
[null,null,null,null,null,null,null,null,null,null,null,null,null,null,null,null,null,null,null,null,null,null,null,null,null,null,null,null,null,null,null,null,null,null,null,null,null,null,null,null,null,null,null,null,null,null,346,{"$error":"#REF!"},{"$error":"#REF!"},{"$error":"#REF!"},{"$error":"#REF!"},{"$error":"#REF!"},null,null,null,null,null,null,null,null,null,null,null,null,null,null,null,null,null,null,null,"","",null,null,null,"","","",null,"","","","","","","",""]
[null,null,null,null,null,null,null,null,null,null,null,null,null,null,null,null,null,null,null,null,null,null,null,null,null,null,null,null,null,null,null,null,null,null,null,null,null,null,null,null,null,null,null,null,null,null,347,{"$error":"#REF!"},{"$error":"#REF!"},{"$error":"#REF!"},{"$error":"#REF!"},{"$error":"#REF!"},null,null,null,null,null,null,null,null,null,null,null,null,null,null,null,null,null,null,null,"","",null,null,null,"","","",null,"","","","","","","",""]
[null,null,null,null,null,null,null,null,null,null,null,null,null,null,null,null,null,null,null,null,null,null,null,null,null,null,null,null,null,null,null,null,null,null,null,null,null,null,null,null,null,null,null,null,null,null,348,{"$error":"#REF!"},{"$error":"#REF!"},{"$error":"#REF!"},{"$error":"#REF!"},{"$error":"#REF!"},null,null,null,null,null,null,null,null,null,null,null,null,null,null,null,null,null,null,null,"","",null,null,null,"","","",null,{"$f":"+IF(BT348=\"\",\"\",BT348)","v":""},"","","","","","",""]
[null,null,null,null,null,null,null,null,null,null,null,null,null,null,null,null,null,null,null,null,null,null,null,null,null,null,null,null,null,null,null,null,null,null,null,null,null,null,null,null,null,null,null,null,null,null,349,{"$error":"#REF!"},{"$error":"#REF!"},{"$error":"#REF!"},{"$error":"#REF!"},{"$error":"#REF!"},null,null,null,null,null,null,null,null,null,null,null,null,null,null,null,null,null,null,null,"","",null,null,null,"","","",null,"","","","","","","",""]
[null,null,null,null,null,null,null,null,null,null,null,null,null,null,null,null,null,null,null,null,null,null,null,null,null,null,null,null,null,null,null,null,null,null,null,null,null,null,null,null,null,null,null,null,null,null,350,{"$error":"#REF!"},{"$error":"#REF!"},{"$error":"#REF!"},{"$error":"#REF!"},{"$error":"#REF!"},null,null,null,null,null,null,null,null,null,null,null,null,null,null,null,null,null,null,null,"","",null,null,null,"","","",null,"","","","","","","",""]
[null,null,null,null,null,null,null,null,null,null,null,null,null,null,null,null,null,null,null,null,null,null,null,null,null,null,null,null,null,null,null,null,null,null,null,null,null,null,null,null,null,null,null,null,null,null,351,{"$error":"#REF!"},{"$error":"#REF!"},{"$error":"#REF!"},{"$error":"#REF!"},{"$error":"#REF!"},null,null,null,null,null,null,null,null,null,null,null,null,null,null,null,null,null,null,null,"","",null,null,null,"","","",null,"","","","","","","",""]
[null,null,null,null,null,null,null,null,null,null,null,null,null,null,null,null,null,null,null,null,null,null,null,null,null,null,null,null,null,null,null,null,null,null,null,null,null,null,null,null,null,null,null,null,null,null,352,{"$error":"#REF!"},{"$error":"#REF!"},{"$error":"#REF!"},{"$error":"#REF!"},{"$error":"#REF!"},null,null,null,null,null,null,null,null,null,null,null,null,null,null,null,null,null,null,null,"","",null,null,null,"","","",null,"","","","","","","",""]
[null,null,null,null,null,null,null,null,null,null,null,null,null,null,null,null,null,null,null,null,null,null,null,null,null,null,null,null,null,null,null,null,null,null,null,null,null,null,null,null,null,null,null,null,null,null,353,{"$error":"#REF!"},{"$error":"#REF!"},{"$error":"#REF!"},{"$error":"#REF!"},{"$error":"#REF!"},null,null,null,null,null,null,null,null,null,null,null,null,null,null,null,null,null,null,null,"","",null,null,null,"","","",null,"","","","","","","",""]
[null,null,null,null,null,null,null,null,null,null,null,null,null,null,null,null,null,null,null,null,null,null,null,null,null,null,null,null,null,null,null,null,null,null,null,null,null,null,null,null,null,null,null,null,null,null,354,{"$error":"#REF!"},{"$error":"#REF!"},{"$error":"#REF!"},{"$error":"#REF!"},{"$error":"#REF!"},null,null,null,null,null,null,null,null,null,null,null,null,null,null,null,null,null,null,null,"","",null,null,null,"","","",null,"","","","","","","",""]
[null,null,null,null,null,null,null,null,null,null,null,null,null,null,null,null,null,null,null,null,null,null,null,null,null,null,null,null,null,null,null,null,null,null,null,null,null,null,null,null,null,null,null,null,null,null,355,{"$error":"#REF!"},{"$error":"#REF!"},{"$error":"#REF!"},{"$error":"#REF!"},{"$error":"#REF!"},null,null,null,null,null,null,null,null,null,null,null,null,null,null,null,null,null,null,null,"","",null,null,null,{"$f":"+IF(AND(TRIM(BW355)=\"\",TRIM(BW354)<>\"\"),EDATE(BY354,1),IF(TRIM(BW355)=\"\",\"\",TRUNC(BW355,0)))","v":""},{"$f":"+IF(BY355=\"\",\"\",IF(BY355<=VDAT_AT,BY355,\"\"))","v":""},{"$f":"+IF(BY355>VDAT_AT,\"\",IF(AND(BZ355<>\"\",BZ356=\"\"),0.01,IF(TRIM(BX355)=\"\",\"\",BX355)))","v":""},null,"","","","","","","",""]
[null,null,null,null,null,null,null,null,null,null,null,null,null,null,null,null,null,null,null,null,null,null,null,null,null,null,null,null,null,null,null,null,null,null,null,null,null,null,null,null,null,null,null,null,null,null,356,{"$error":"#REF!"},{"$error":"#REF!"},{"$error":"#REF!"},{"$error":"#REF!"},{"$error":"#REF!"},null,null,null,null,null,null,null,null,null,null,null,null,null,null,null,null,null,null,null,"","",null,null,null,"","","",null,"","","","","","","",""]
[null,null,null,null,null,null,null,null,null,null,null,null,null,null,null,null,null,null,null,null,null,null,null,null,null,null,null,null,null,null,null,null,null,null,null,null,null,null,null,null,null,null,null,null,null,null,357,{"$error":"#REF!"},{"$error":"#REF!"},{"$error":"#REF!"},{"$error":"#REF!"},{"$error":"#REF!"},null,null,null,null,null,null,null,null,null,null,null,null,null,null,null,null,null,null,null,"","",null,null,null,"","","",null,"","","","","","","",""]
[null,null,null,null,null,null,null,null,null,null,null,null,null,null,null,null,null,null,null,null,null,null,null,null,null,null,null,null,null,null,null,null,null,null,null,null,null,null,null,null,null,null,null,null,null,null,358,{"$error":"#REF!"},{"$error":"#REF!"},{"$error":"#REF!"},{"$error":"#REF!"},{"$error":"#REF!"},null,null,null,null,null,null,null,null,null,null,null,null,null,null,null,null,null,null,null,"","",null,null,null,"","","",null,"","","","","","","",""]
[null,null,null,null,null,null,null,null,null,null,null,null,null,null,null,null,null,null,null,null,null,null,null,null,null,null,null,null,null,null,null,null,null,null,null,null,null,null,null,null,null,null,null,null,null,null,359,{"$error":"#REF!"},{"$error":"#REF!"},{"$error":"#REF!"},{"$error":"#REF!"},{"$error":"#REF!"},null,null,null,null,null,null,null,null,null,null,null,null,null,null,null,null,null,null,null,"","",null,null,null,"","","",null,"","","","","","","",""]
[null,null,null,null,null,null,null,null,null,null,null,null,null,null,null,null,null,null,null,null,null,null,null,null,null,null,null,null,null,null,null,null,null,null,null,null,null,null,null,null,null,null,null,null,null,null,360,{"$error":"#REF!"},{"$error":"#REF!"},{"$error":"#REF!"},{"$error":"#REF!"},{"$error":"#REF!"},null,null,null,null,null,null,null,null,null,null,null,null,null,null,null,null,null,null,null,"","",null,null,null,"","","",null,"","","","","",{"$f":"+IF(OR(COD_JUROS<>10,CD360=\"\"),\"\",CA400)","v":""},"",""]
[null,null,null,null,null,null,null,null,null,null,null,null,null,null,null,null,null,null,null,null,null,null,null,null,null,null,null,null,null,null,null,null,null,null,null,null,null,null,null,null,null,null,null,null,null,null,361,{"$error":"#REF!"},{"$error":"#REF!"},{"$error":"#REF!"},{"$error":"#REF!"},{"$error":"#REF!"},null,null,null,null,null,null,null,null,null,null,null,null,null,null,null,null,null,null,null,null,null,null,null,null,{"$f":"+IF(AND(TRIM(BW361)=\"\",TRIM(BW360)<>\"\"),EDATE(BY360,1),IF(TRIM(BW361)=\"\",\"\",TRUNC(BW361,0)))","v":""},{"$f":"+IF(BY361=\"\",\"\",IF(BY361<=VDAT_AT,BY361,\"\"))","v":""},{"$f":"+IF(BY361>VDAT_AT,\"\",IF(AND(BZ361<>\"\",BZ362=\"\"),0.01,IF(TRIM(BX361)=\"\",\"\",BX361)))","v":""}]
[null,null,null,null,null,null,null,null,null,null,null,null,null,null,null,null,null,null,null,null,null,null,null,null,null,null,null,null,null,null,null,null,null,null,null,null,null,null,null,null,null,null,null,null,null,null,362,{"$error":"#REF!"},{"$error":"#REF!"},{"$error":"#REF!"},{"$error":"#REF!"},{"$error":"#REF!"},null,null,null,null,null,null,null,null,null,null,null,null,null,null,null,null,null,null,null,null,null,null,null,null,"","",""]
[null,null,null,null,null,null,null,null,null,null,null,null,null,null,null,null,null,null,null,null,null,null,null,null,null,null,null,null,null,null,null,null,null,null,null,null,null,null,null,null,null,null,null,null,null,null,363,{"$error":"#REF!"},{"$error":"#REF!"},{"$error":"#REF!"},{"$error":"#REF!"},{"$error":"#REF!"},null,null,null,null,null,null,null,null,null,null,null,null,null,null,null,null,null,null,null,null,null,null,null,null,"","",""]
[null,null,null,null,null,null,null,null,null,null,null,null,null,null,null,null,null,null,null,null,null,null,null,null,null,null,null,null,null,null,null,null,null,null,null,null,null,null,null,null,null,null,null,null,null,null,364,{"$error":"#REF!"},{"$error":"#REF!"},{"$error":"#REF!"},{"$error":"#REF!"},{"$error":"#REF!"},null,null,null,null,null,null,null,null,null,null,null,null,null,null,null,null,null,null,null,null,null,null,null,null,"","",""]
[null,null,null,null,null,null,null,null,null,null,null,null,null,null,null,null,null,null,null,null,null,null,null,null,null,null,null,null,null,null,null,null,null,null,null,null,null,null,null,null,null,null,null,null,null,null,365,{"$error":"#REF!"},{"$error":"#REF!"},{"$error":"#REF!"},{"$error":"#REF!"},{"$error":"#REF!"},null,null,null,null,null,null,null,null,null,null,null,null,null,null,null,null,null,null,null,null,null,null,null,null,"","",""]
[null,null,null,null,null,null,null,null,null,null,null,null,null,null,null,null,null,null,null,null,null,null,null,null,null,null,null,null,null,null,null,null,null,null,null,null,null,null,null,null,null,null,null,null,null,null,366,{"$error":"#REF!"},{"$error":"#REF!"},{"$error":"#REF!"},{"$error":"#REF!"},{"$error":"#REF!"},null,null,null,null,null,null,null,null,null,null,null,null,null,null,null,null,null,null,null,null,null,null,null,null,"","",""]
[null,null,null,null,null,null,null,null,null,null,null,null,null,null,null,null,null,null,null,null,null,null,null,null,null,null,null,null,null,null,null,null,null,null,null,null,null,null,null,null,null,null,null,null,null,null,367,{"$error":"#REF!"},{"$error":"#REF!"},{"$error":"#REF!"},{"$error":"#REF!"},{"$error":"#REF!"},null,null,null,null,null,null,null,null,null,null,null,null,null,null,null,null,null,null,null,null,null,null,null,null,"","",""]
[null,null,null,null,null,null,null,null,null,null,null,null,null,null,null,null,null,null,null,null,null,null,null,null,null,null,null,null,null,null,null,null,null,null,null,null,null,null,null,null,null,null,null,null,null,null,368,{"$error":"#REF!"},{"$error":"#REF!"},{"$error":"#REF!"},{"$error":"#REF!"},{"$error":"#REF!"},null,null,null,null,null,null,null,null,null,null,null,null,null,null,null,null,null,null,null,null,null,null,null,null,"","",""]
[null,null,null,null,null,null,null,null,null,null,null,null,null,null,null,null,null,null,null,null,null,null,null,null,null,null,null,null,null,null,null,null,null,null,null,null,null,null,null,null,null,null,null,null,null,null,369,{"$error":"#REF!"},{"$error":"#REF!"},{"$error":"#REF!"},{"$error":"#REF!"},{"$error":"#REF!"},null,null,null,null,null,null,null,null,null,null,null,null,null,null,null,null,null,null,null,null,null,null,null,null,"","",""]
[null,null,null,null,null,null,null,null,null,null,null,null,null,null,null,null,null,null,null,null,null,null,null,null,null,null,null,null,null,null,null,null,null,null,null,null,null,null,null,null,null,null,null,null,null,null,370,{"$error":"#REF!"},{"$error":"#REF!"},{"$error":"#REF!"},{"$error":"#REF!"},{"$error":"#REF!"},null,null,null,null,null,null,null,null,null,null,null,null,null,null,null,null,null,null,null,null,null,null,null,null,"","",""]
[null,null,null,null,null,null,null,null,null,null,null,null,null,null,null,null,null,null,null,null,null,null,null,null,null,null,null,null,null,null,null,null,null,null,null,null,null,null,null,null,null,null,null,null,null,null,371,{"$error":"#REF!"},{"$error":"#REF!"},{"$error":"#REF!"},{"$error":"#REF!"},{"$error":"#REF!"},null,null,null,null,null,null,null,null,null,null,null,null,null,null,null,null,null,null,null,null,null,null,null,null,"","",""]
[null,null,null,null,null,null,null,null,null,null,null,null,null,null,null,null,null,null,null,null,null,null,null,null,null,null,null,null,null,null,null,null,null,null,null,null,null,null,null,null,null,null,null,null,null,null,372,{"$error":"#REF!"},{"$error":"#REF!"},{"$error":"#REF!"},{"$error":"#REF!"},{"$error":"#REF!"},null,null,null,null,null,null,null,null,null,null,null,null,null,null,null,null,null,null,null,null,null,null,null,null,"","",""]
[null,null,null,null,null,null,null,null,null,null,null,null,null,null,null,null,null,null,null,null,null,null,null,null,null,null,null,null,null,null,null,null,null,null,null,null,null,null,null,null,null,null,null,null,null,null,373,{"$error":"#REF!"},{"$error":"#REF!"},{"$error":"#REF!"},{"$error":"#REF!"},{"$error":"#REF!"},null,null,null,null,null,null,null,null,null,null,null,null,null,null,null,null,null,null,null,null,null,null,null,null,"","",""]
[null,null,null,null,null,null,null,null,null,null,null,null,null,null,null,null,null,null,null,null,null,null,null,null,null,null,null,null,null,null,null,null,null,null,null,null,null,null,null,null,null,null,null,null,null,null,374,{"$error":"#REF!"},{"$error":"#REF!"},{"$error":"#REF!"},{"$error":"#REF!"},{"$error":"#REF!"},null,null,null,null,null,null,null,null,null,null,null,null,null,null,null,null,null,null,null,null,null,null,null,null,"","",""]
[null,null,null,null,null,null,null,null,null,null,null,null,null,null,null,null,null,null,null,null,null,null,null,null,null,null,null,null,null,null,null,null,null,null,null,null,null,null,null,null,null,null,null,null,null,null,375,{"$error":"#REF!"},{"$error":"#REF!"},{"$error":"#REF!"},{"$error":"#REF!"},{"$error":"#REF!"},null,null,null,null,null,null,null,null,null,null,null,null,null,null,null,null,null,null,null,null,null,null,null,null,"","",""]
[null,null,null,null,null,null,null,null,null,null,null,null,null,null,null,null,null,null,null,null,null,null,null,null,null,null,null,null,null,null,null,null,null,null,null,null,null,null,null,null,null,null,null,null,null,null,376,{"$error":"#REF!"},{"$error":"#REF!"},{"$error":"#REF!"},{"$error":"#REF!"},{"$error":"#REF!"},null,null,null,null,null,null,null,null,null,null,null,null,null,null,null,null,null,null,null,null,null,null,null,null,"","",""]
[null,null,null,null,null,null,null,null,null,null,null,null,null,null,null,null,null,null,null,null,null,null,null,null,null,null,null,null,null,null,null,null,null,null,null,null,null,null,null,null,null,null,null,null,null,null,377,{"$error":"#REF!"},{"$error":"#REF!"},{"$error":"#REF!"},{"$error":"#REF!"},{"$error":"#REF!"},null,null,null,null,null,null,null,null,null,null,null,null,null,null,null,null,null,null,null,null,null,null,null,null,"","",""]
[null,null,null,null,null,null,null,null,null,null,null,null,null,null,null,null,null,null,null,null,null,null,null,null,null,null,null,null,null,null,null,null,null,null,null,null,null,null,null,null,null,null,null,null,null,null,378,{"$error":"#REF!"},{"$error":"#REF!"},{"$error":"#REF!"},{"$error":"#REF!"},{"$error":"#REF!"},null,null,null,null,null,null,null,null,null,null,null,null,null,null,null,null,null,null,null,null,null,null,null,null,"","",""]
[null,null,null,null,null,null,null,null,null,null,null,null,null,null,null,null,null,null,null,null,null,null,null,null,null,null,null,null,null,null,null,null,null,null,null,null,null,null,null,null,null,null,null,null,null,null,379,{"$f":"IF(INDIRECT(CONCATENATE(VLET_DT,TEXT(AU379,\"#0\")))=\"\",\"\",INDIRECT(CONCATENATE(VLET_DT,TEXT(AU379,\"#0\"))))","v":{"$error":"#REF!"}},{"$f":"+IF(AV379=\"\",\"\",IF(AV379<=VDAT_AT,AV379,\"\"))","v":{"$error":"#REF!"}},{"$f":"IF(OR(AW379=\"\",INDIRECT(CONCATENATE(VLET_COT,TEXT(AU379,\"#0\")))=\"\"),\"\",IF(AW379=VDAT_AT,1+IF(COD_CM=4,0.01,0),INDIRECT(CONCATENATE(VLET_COT,TEXT(AU379,\"#0\")))))","v":{"$error":"#REF!"}},{"$error":"#REF!"},{"$error":"#REF!"},null,null,null,null,null,null,null,null,null,null,null,null,null,null,null,null,null,null,null,null,null,null,null,null,"","",""]
[null,null,null,null,null,null,null,null,null,null,null,null,null,null,null,null,null,null,null,null,null,null,null,null,null,null,null,null,null,null,null,null,null,null,null,null,null,null,null,null,null,null,null,null,null,null,380,{"$error":"#REF!"},{"$error":"#REF!"},{"$error":"#REF!"},{"$error":"#REF!"},{"$error":"#REF!"},null,null,null,null,null,null,null,null,null,null,null,null,null,null,null,null,null,null,null,null,null,null,null,null,"","",""]
[null,null,null,null,null,null,null,null,null,null,null,null,null,null,null,null,null,null,null,null,null,null,null,null,null,null,null,null,null,null,null,null,null,null,null,null,null,null,null,null,null,null,null,null,null,null,381,{"$error":"#REF!"},{"$error":"#REF!"},{"$error":"#REF!"},{"$error":"#REF!"},{"$error":"#REF!"},null,null,null,null,null,null,null,null,null,null,null,null,null,null,null,null,null,null,null,null,null,null,null,null,"","",""]
[null,null,null,null,null,null,null,null,null,null,null,null,null,null,null,null,null,null,null,null,null,null,null,null,null,null,null,null,null,null,null,null,null,null,null,null,null,null,null,null,null,null,null,null,null,null,382,{"$error":"#REF!"},{"$error":"#REF!"},{"$error":"#REF!"},{"$error":"#REF!"},{"$error":"#REF!"},null,null,null,null,null,null,null,null,null,null,null,null,null,null,null,null,null,null,null,null,null,null,null,null,"","",""]
[null,null,null,null,null,null,null,null,null,null,null,null,null,null,null,null,null,null,null,null,null,null,null,null,null,null,null,null,null,null,null,null,null,null,null,null,null,null,null,null,null,null,null,null,null,null,383,{"$error":"#REF!"},{"$error":"#REF!"},{"$error":"#REF!"},{"$error":"#REF!"},{"$error":"#REF!"},null,null,null,null,null,null,null,null,null,null,null,null,null,null,null,null,null,null,null,null,null,null,null,null,"","",""]
[null,null,null,null,null,null,null,null,null,null,null,null,null,null,null,null,null,null,null,null,null,null,null,null,null,null,null,null,null,null,null,null,null,null,null,null,null,null,null,null,null,null,null,null,null,null,384,{"$error":"#REF!"},{"$error":"#REF!"},{"$error":"#REF!"},{"$error":"#REF!"},{"$error":"#REF!"},null,null,null,null,null,null,null,null,null,null,null,null,null,null,null,null,null,null,null,null,null,null,null,null,"","",""]
[null,null,null,null,null,null,null,null,null,null,null,null,null,null,null,null,null,null,null,null,null,null,null,null,null,null,null,null,null,null,null,null,null,null,null,null,null,null,null,null,null,null,null,null,null,null,385,{"$error":"#REF!"},{"$error":"#REF!"},{"$error":"#REF!"},{"$error":"#REF!"},{"$error":"#REF!"},null,null,null,null,null,null,null,null,null,null,null,null,null,null,null,null,null,null,null,null,null,null,null,null,"","",""]
[null,null,null,null,null,null,null,null,null,null,null,null,null,null,null,null,null,null,null,null,null,null,null,null,null,null,null,null,null,null,null,null,null,null,null,null,null,null,null,null,null,null,null,null,null,null,386,{"$error":"#REF!"},{"$error":"#REF!"},{"$error":"#REF!"},{"$error":"#REF!"},{"$error":"#REF!"},null,null,null,null,null,null,null,null,null,null,null,null,null,null,null,null,null,null,null,null,null,null,null,null,"","",""]
[null,null,null,null,null,null,null,null,null,null,null,null,null,null,null,null,null,null,null,null,null,null,null,null,null,null,null,null,null,null,null,null,null,null,null,null,null,null,null,null,null,null,null,null,null,null,387,{"$error":"#REF!"},{"$error":"#REF!"},{"$error":"#REF!"},{"$error":"#REF!"},{"$error":"#REF!"},null,null,null,null,null,null,null,null,null,null,null,null,null,null,null,null,null,null,null,null,null,null,null,null,"","",""]
[null,null,null,null,null,null,null,null,null,null,null,null,null,null,null,null,null,null,null,null,null,null,null,null,null,null,null,null,null,null,null,null,null,null,null,null,null,null,null,null,null,null,null,null,null,null,388,{"$error":"#REF!"},{"$error":"#REF!"},{"$error":"#REF!"},{"$error":"#REF!"},{"$error":"#REF!"},null,null,null,null,null,null,null,null,null,null,null,null,null,null,null,null,null,null,null,null,null,null,null,null,"","",""]
[null,null,null,null,null,null,null,null,null,null,null,null,null,null,null,null,null,null,null,null,null,null,null,null,null,null,null,null,null,null,null,null,null,null,null,null,null,null,null,null,null,null,null,null,null,null,389,{"$error":"#REF!"},{"$error":"#REF!"},{"$error":"#REF!"},{"$error":"#REF!"},{"$error":"#REF!"},null,null,null,null,null,null,null,null,null,null,null,null,null,null,null,null,null,null,null,null,null,null,null,null,"","",""]
[null,null,null,null,null,null,null,null,null,null,null,null,null,null,null,null,null,null,null,null,null,null,null,null,null,null,null,null,null,null,null,null,null,null,null,null,null,null,null,null,null,null,null,null,null,null,390,{"$error":"#REF!"},{"$error":"#REF!"},{"$error":"#REF!"},{"$error":"#REF!"},{"$error":"#REF!"},null,null,null,null,null,null,null,null,null,null,null,null,null,null,null,null,null,null,null,null,null,null,null,null,"","",""]
[null,null,null,null,null,null,null,null,null,null,null,null,null,null,null,null,null,null,null,null,null,null,null,null,null,null,null,null,null,null,null,null,null,null,null,null,null,null,null,null,null,null,null,null,null,null,391,{"$error":"#REF!"},{"$error":"#REF!"},{"$error":"#REF!"},{"$error":"#REF!"},{"$error":"#REF!"},null,null,null,null,null,null,null,null,null,null,null,null,null,null,null,null,null,null,null,null,null,null,null,null,"","",""]
[null,null,null,null,null,null,null,null,null,null,null,null,null,null,null,null,null,null,null,null,null,null,null,null,null,null,null,null,null,null,null,null,null,null,null,null,null,null,null,null,null,null,null,null,null,null,392,{"$error":"#REF!"},{"$error":"#REF!"},{"$error":"#REF!"},{"$error":"#REF!"},{"$error":"#REF!"},null,null,null,null,null,null,null,null,null,null,null,null,null,null,null,null,null,null,null,null,null,null,null,null,"","",""]
[null,null,null,null,null,null,null,null,null,null,null,null,null,null,null,null,null,null,null,null,null,null,null,null,null,null,null,null,null,null,null,null,null,null,null,null,null,null,null,null,null,null,null,null,null,null,393,{"$error":"#REF!"},{"$error":"#REF!"},{"$error":"#REF!"},{"$f":"+IF(COD_CM=4,IF(AX393=\"\",\"\",AX393+IF(AY394=\"\",0,AY394)),IF(OR(AV393>VDAT_AT,AV393=\"\"),\"\",IF(AV393=VDAT_AT,1,IF(AY394=\"\",1,AY394)*(1+AX393)/AZ393)))","v":{"$error":"#REF!"}},{"$f":"+IF(AW393=\"\",\"\",LOOKUP(AW393,COL_DAT_CORTE,COL_VAL_CORTE))","v":{"$error":"#REF!"}},null,null,null,null,null,null,null,null,null,null,null,null,null,null,null,null,null,null,null,null,null,null,null,null,"","",""]
[null,null,null,null,null,null,null,null,null,null,null,null,null,null,null,null,null,null,null,null,null,null,null,null,null,null,null,null,null,null,null,null,null,null,null,null,null,null,null,null,null,null,null,null,null,null,394,{"$error":"#REF!"},{"$error":"#REF!"},{"$error":"#REF!"},{"$error":"#REF!"},{"$error":"#REF!"},null,null,null,null,null,null,null,null,null,null,null,null,null,null,null,null,null,null,null,null,null,null,null,null,"","","",null,"acrescentar sempre um mês posterior sem indice"]
[null,null,null,null,null,null,null,null,null,null,null,null,null,null,null,null,null,null,null,null,null,null,null,null,null,null,null,null,null,null,null,null,null,null,null,null,null,null,null,null,null,null,null,null,null,null,395,{"$error":"#REF!"},{"$error":"#REF!"},{"$error":"#REF!"},{"$error":"#REF!"},{"$error":"#REF!"},null,null,null,null,null,null,null,null,null,null,null,null,null,null,null,null,null,null,null,null,null,null,null,null,"","",""]
[null,null,null,null,null,null,null,null,null,null,null,null,null,null,null,null,null,null,null,null,null,null,null,null,null,null,null,null,null,null,null,null,null,null,null,null,null,null,null,null,null,null,null,null,null,null,396,{"$error":"#REF!"},{"$error":"#REF!"},{"$error":"#REF!"},{"$error":"#REF!"},{"$error":"#REF!"},null,null,null,null,null,null,null,null,null,null,null,null,null,null,null,null,null,null,null,null,null,null,null,null,"","",""]
[null,null,null,null,null,null,null,null,null,null,null,null,null,null,null,null,null,null,null,null,null,null,null,null,null,null,null,null,null,null,null,null,null,null,null,null,null,null,null,null,null,null,null,null,null,null,397,{"$error":"#REF!"},{"$error":"#REF!"},{"$error":"#REF!"},{"$error":"#REF!"},{"$error":"#REF!"},null,null,null,null,null,null,null,null,null,null,null,null,null,null,null,null,null,null,null,null,null,null,null,null,"","",""]
[null,null,null,null,null,null,null,null,null,null,null,null,null,null,null,null,null,null,null,null,null,null,null,null,null,null,null,null,null,null,null,null,null,null,null,null,null,null,null,null,null,null,null,null,null,null,398,{"$error":"#REF!"},{"$error":"#REF!"},{"$error":"#REF!"},{"$error":"#REF!"},{"$error":"#REF!"},null,null,null,null,null,null,null,null,null,null,null,null,null,null,null,null,null,null,null,null,null,null,null,null,"","",""]
[null,null,null,null,null,null,null,null,null,null,null,null,null,null,null,null,null,null,null,null,null,null,null,null,null,null,null,null,null,null,null,null,null,null,null,null,null,null,null,null,null,null,null,null,null,null,399,{"$error":"#REF!"},{"$error":"#REF!"},{"$error":"#REF!"},{"$error":"#REF!"},{"$error":"#REF!"},null,null,null,null,null,null,null,null,null,null,null,null,null,null,null,null,null,null,null,null,null,null,null,null,"","",""]
[null,null,null,null,null,null,null,null,null,null,null,null,null,null,null,null,null,null,null,null,null,null,null,null,null,null,null,null,null,null,null,null,null,null,null,null,null,null,null,null,null,null,null,null,null,null,400,{"$error":"#REF!"},{"$error":"#REF!"},{"$error":"#REF!"},{"$f":"+IF(COD_CM=4,IF(AX400=\"\",\"\",AX400+IF(#REF!=\"\",0,#REF!)),IF(OR(AV400>VDAT_AT,AV400=\"\"),\"\",IF(AV400=VDAT_AT,1,IF(#REF!=\"\",1,#REF!)*(1+AX400)/AZ400)))","v":{"$error":"#REF!"}},{"$error":"#REF!"},null,null,null,null,null,null,null,null,null,null,null,null,null,null,null,null,null,null,null,null,null,null,null,null,"","",""]

{"sheet":"rascunho","index":5,"n_rows":29,"n_cols":29,"rows_kept":29,"cut":false,"hidden":true,"merged":[[5,25,5,27],[4,25,4,27],[1,1,1,7],[1,19,1,20],[1,21,1,22],[2,25,2,28],[3,25,3,27],[18,25,19,28],[16,25,17,28],[6,25,6,27],[9,25,9,28],[10,25,11,28],[14,25,15,28],[12,25,13,28],[7,25,7,27]]}
[]
[null,"BD",null,null,null,null,null,null,null,null,null,null,null,null,null,null,null,null,null,"ATUALIZADO",null,"JUROS"]
[null,"REF","TIPO","HISTÓRICO","DATA","PRINCIPAL","JUROS","FOLHAS",null,"ORD","COD",null,"DESCRIÇÃO","FOLHAS","DATA","DATA","PRINCIPAL","JUROS","COEF. AT.","PRINCIPAL","JUROS","%","VALOR","TOTAL",null,"RESUMO GERAL"]
[null,1,{"$f":"+IF(cadastro!O6<>\"OK\",\"\",cadastro!P6)","v":""},{"$f":"+IF(C4=\"\",\"\",IF(cadastro!L6<>\"\",cadastro!L6,IF(C4=\"C\",\"Parcela Positiva\",\"Parcela Negativa\")))","v":""},{"$f":"+IF(C4=\"\",\"\",TRUNC(cadastro!H6,0)+B4/1000)","v":""},{"$f":"+IF(C4=\"\",\"\",cadastro!I6*IF(C4=\"D\",-1,1))","v":""},{"$f":"+IF(C4=\"\",\"\",cadastro!M6*IF(C4=\"D\",-1,1))","v":""},{"$f":"+IF(C4=\"\",\"\",LOWER(cadastro!N6))","v":""},null,{"$f":"+IF(ISERR(SMALL(E:E,B4)),\"\",SMALL(E:E,B4))","v":""},{"$f":"+IF(J4=\"\",\"\",ROUND((J4-TRUNC(J4,0))*1000,0))","v":""},null,{"$f":"+IF(K4=\"\",\"\",(LOOKUP(K4,B:B,D:D)))","v":""},{"$f":"+IF(K4=\"\",\"\",LOOKUP(K4,B:B,H:H))","v":""},{"$f":"+IF(J4=\"\",\"\",TRUNC(J4,0))","v":""},{"$f":"+IF(O4=\"\",\"\",EOMONTH(O4,-1)+1)","v":""},{"$f":"+IF(K4=\"\",\"\",LOOKUP(K4,B:B,F:F))","v":""},{"$f":"+IF(K4=\"\",\"\",LOOKUP(K4,B:B,G:G))","v":""},{"$f":"IF(P4=\"\",\"\",IF(COD_CM=0,1,LOOKUP(IF(COD_CM=4,EDATE(P4,1),P4),tabelas!AW:AW,tabelas!AY:AY)))","v":""},{"$f":"+IF(K4=\"\",\"\",TRUNC(Q4*S4,2))","v":""},{"$f":"+IF(K4=\"\",\"\",TRUNC(R4*S4,2))","v":""},{"$f":"+IF(P4=\"\",\"\",LOOKUP(EDATE(MAXA(VDAT_JUR1,P4),0),tabelas!CD:CD,tabelas!CJ:CJ))","v":""},{"$f":"+IF(P4=\"\",\"\",TRUNC(T4*V4,2))","v":""},{"$f":"+IF(P4=\"\",\"\",U4+W4+T4)","v":""},null,"TOTAL DO PRINCIPAL:",null,null,{"$f":"+T29","v":0}]
[null,2,{"$f":"+IF(cadastro!O7<>\"OK\",\"\",cadastro!P7)","v":""},{"$f":"+IF(C5=\"\",\"\",IF(cadastro!L7<>\"\",cadastro!L7,IF(C5=\"C\",\"Parcela Positiva\",\"Parcela Negativa\")))","v":""},{"$f":"+IF(C5=\"\",\"\",TRUNC(cadastro!H7,0)+B5/1000)","v":""},{"$f":"+IF(C5=\"\",\"\",cadastro!I7*IF(C5=\"D\",-1,1))","v":""},{"$f":"+IF(C5=\"\",\"\",cadastro!M7*IF(C5=\"D\",-1,1))","v":""},{"$f":"+IF(C5=\"\",\"\",LOWER(cadastro!N7))","v":""},null,"",{"$f":"+IF(J5=\"\",\"\",ROUND((J5-TRUNC(J5,0))*1000,0))","v":""},null,"","",{"$f":"+IF(J5=\"\",\"\",TRUNC(J5,0))","v":""},{"$f":"+IF(O5=\"\",\"\",EOMONTH(O5,-1)+1)","v":""},"","",{"$f":"IF(P5=\"\",\"\",IF(COD_CM=0,1,LOOKUP(IF(COD_CM=4,EDATE(P5,1),P5),tabelas!AW:AW,tabelas!AY:AY)))","v":""},{"$f":"+IF(K5=\"\",\"\",TRUNC(Q5*S5,2))","v":""},"",{"$f":"+IF(P5=\"\",\"\",LOOKUP(EDATE(MAXA(VDAT_JUR1,P5),0),tabelas!CD:CD,tabelas!CJ:CJ))","v":""},"","",null,"TOTAL DO JUROS:",null,null,{"$f":"+U29+W29","v":0}]
[null,3,{"$f":"+IF(cadastro!O8<>\"OK\",\"\",cadastro!P8)","v":""},{"$f":"+IF(C6=\"\",\"\",IF(cadastro!L8<>\"\",cadastro!L8,IF(C6=\"C\",\"Parcela Positiva\",\"Parcela Negativa\")))","v":""},{"$f":"+IF(C6=\"\",\"\",TRUNC(cadastro!H8,0)+B6/1000)","v":""},{"$f":"+IF(C6=\"\",\"\",cadastro!I8*IF(C6=\"D\",-1,1))","v":""},{"$f":"+IF(C6=\"\",\"\",cadastro!M8*IF(C6=\"D\",-1,1))","v":""},{"$f":"+IF(C6=\"\",\"\",LOWER(cadastro!N8))","v":""},null,"","",null,"","","","","","",{"$f":"IF(P6=\"\",\"\",IF(COD_CM=0,1,LOOKUP(IF(COD_CM=4,EDATE(P6,1),P6),tabelas!AW:AW,tabelas!AY:AY)))","v":""},"","",{"$f":"+IF(P6=\"\",\"\",LOOKUP(EDATE(MAXA(VDAT_JUR1,P6),0),tabelas!CD:CD,tabelas!CJ:CJ))","v":""},"","",null,"DIFERENÇA APURADA:",null,null,{"$f":"+AC4+AC5","v":0}]
[null,4,{"$f":"+IF(cadastro!O9<>\"OK\",\"\",cadastro!P9)","v":""},{"$f":"+IF(C7=\"\",\"\",IF(cadastro!L9<>\"\",cadastro!L9,IF(C7=\"C\",\"Parcela Positiva\",\"Parcela Negativa\")))","v":""},{"$f":"+IF(C7=\"\",\"\",TRUNC(cadastro!H9,0)+B7/1000)","v":""},{"$f":"+IF(C7=\"\",\"\",cadastro!I9*IF(C7=\"D\",-1,1))","v":""},{"$f":"+IF(C7=\"\",\"\",cadastro!M9*IF(C7=\"D\",-1,1))","v":""},{"$f":"+IF(C7=\"\",\"\",LOWER(cadastro!N9))","v":""},null,"","",null,"","","","","","",{"$f":"IF(P7=\"\",\"\",IF(COD_CM=0,1,LOOKUP(IF(COD_CM=4,EDATE(P7,1),P7),tabelas!AW:AW,tabelas!AY:AY)))","v":""},"","",{"$f":"+IF(P7=\"\",\"\",LOOKUP(EDATE(MAXA(VDAT_JUR1,P7),0),tabelas!CD:CD,tabelas!CJ:CJ))","v":""},"","",null,"TOTAL DEVIDO:",null,null,{"$f":"+IF(AC6<0,0,AC6)","v":0}]
[null,5,{"$f":"+IF(cadastro!O10<>\"OK\",\"\",cadastro!P10)","v":""},{"$f":"+IF(C8=\"\",\"\",IF(cadastro!L10<>\"\",cadastro!L10,IF(C8=\"C\",\"Parcela Positiva\",\"Parcela Negativa\")))","v":""},{"$f":"+IF(C8=\"\",\"\",TRUNC(cadastro!H10,0)+B8/1000)","v":""},{"$f":"+IF(C8=\"\",\"\",cadastro!I10*IF(C8=\"D\",-1,1))","v":""},{"$f":"+IF(C8=\"\",\"\",cadastro!M10*IF(C8=\"D\",-1,1))","v":""},{"$f":"+IF(C8=\"\",\"\",LOWER(cadastro!N10))","v":""},null,"","",null,"","","","","","",{"$f":"IF(P8=\"\",\"\",IF(COD_CM=0,1,LOOKUP(IF(COD_CM=4,EDATE(P8,1),P8),tabelas!AW:AW,tabelas!AY:AY)))","v":""},"","",{"$f":"+IF(P8=\"\",\"\",LOOKUP(EDATE(MAXA(VDAT_JUR1,P8),0),tabelas!CD:CD,tabelas!CJ:CJ))","v":""},"","",null,"SIT_IMP",null,null,{"$f":"+IF(M4<>\"\",\"S\",\"\")","v":""}]
[null,6,{"$f":"+IF(cadastro!O11<>\"OK\",\"\",cadastro!P11)","v":""},{"$f":"+IF(C9=\"\",\"\",IF(cadastro!L11<>\"\",cadastro!L11,IF(C9=\"C\",\"Parcela Positiva\",\"Parcela Negativa\")))","v":""},{"$f":"+IF(C9=\"\",\"\",TRUNC(cadastro!H11,0)+B9/1000)","v":""},{"$f":"+IF(C9=\"\",\"\",cadastro!I11*IF(C9=\"D\",-1,1))","v":""},{"$f":"+IF(C9=\"\",\"\",cadastro!M11*IF(C9=\"D\",-1,1))","v":""},{"$f":"+IF(C9=\"\",\"\",LOWER(cadastro!N11))","v":""},null,"","",null,"","","","","","",{"$f":"IF(P9=\"\",\"\",IF(COD_CM=0,1,LOOKUP(IF(COD_CM=4,EDATE(P9,1),P9),tabelas!AW:AW,tabelas!AY:AY)))","v":""},"","",{"$f":"+IF(P9=\"\",\"\",LOOKUP(EDATE(MAXA(VDAT_JUR1,P9),0),tabelas!CD:CD,tabelas!CJ:CJ))","v":""},"",""]
[null,7,{"$f":"+IF(cadastro!O12<>\"OK\",\"\",cadastro!P12)","v":""},{"$f":"+IF(C10=\"\",\"\",IF(cadastro!L12<>\"\",cadastro!L12,IF(C10=\"C\",\"Parcela Positiva\",\"Parcela Negativa\")))","v":""},{"$f":"+IF(C10=\"\",\"\",TRUNC(cadastro!H12,0)+B10/1000)","v":""},{"$f":"+IF(C10=\"\",\"\",cadastro!I12*IF(C10=\"D\",-1,1))","v":""},{"$f":"+IF(C10=\"\",\"\",cadastro!M12*IF(C10=\"D\",-1,1))","v":""},{"$f":"+IF(C10=\"\",\"\",LOWER(cadastro!N12))","v":""},null,"","",null,"","","","","","",{"$f":"IF(P10=\"\",\"\",IF(COD_CM=0,1,LOOKUP(IF(COD_CM=4,EDATE(P10,1),P10),tabelas!AW:AW,tabelas!AY:AY)))","v":""},"","",{"$f":"+IF(P10=\"\",\"\",LOOKUP(EDATE(MAXA(VDAT_JUR1,P10),0),tabelas!CD:CD,tabelas!CJ:CJ))","v":""},"","",null,"MEMÓRIA DE CÁLCULO"]
[null,8,{"$f":"+IF(cadastro!O13<>\"OK\",\"\",cadastro!P13)","v":""},{"$f":"+IF(C11=\"\",\"\",IF(cadastro!L13<>\"\",cadastro!L13,IF(C11=\"C\",\"Parcela Positiva\",\"Parcela Negativa\")))","v":""},{"$f":"+IF(C11=\"\",\"\",TRUNC(cadastro!H13,0)+B11/1000)","v":""},{"$f":"+IF(C11=\"\",\"\",cadastro!I13*IF(C11=\"D\",-1,1))","v":""},{"$f":"+IF(C11=\"\",\"\",cadastro!M13*IF(C11=\"D\",-1,1))","v":""},{"$f":"+IF(C11=\"\",\"\",LOWER(cadastro!N13))","v":""},null,"","",null,"","","","","","",{"$f":"IF(P11=\"\",\"\",IF(COD_CM=0,1,LOOKUP(IF(COD_CM=4,EDATE(P11,1),P11),tabelas!AW:AW,tabelas!AY:AY)))","v":""},"","",{"$f":"+IF(P11=\"\",\"\",LOOKUP(EDATE(MAXA(VDAT_JUR1,P11),0),tabelas!CD:CD,tabelas!CJ:CJ))","v":""},"","",null,{"$f":"+IF(cadastro!T50=\"\",\"\",LOOKUP(MATCH(cadastro!T50,tabelas!BD9:BD26,0),tabelas!BB:BB,tabelas!BK:BK))","v":"Sem correção monetária"}]
[null,9,{"$f":"+IF(cadastro!O14<>\"OK\",\"\",cadastro!P14)","v":""},{"$f":"+IF(C12=\"\",\"\",IF(cadastro!L14<>\"\",cadastro!L14,IF(C12=\"C\",\"Parcela Positiva\",\"Parcela Negativa\")))","v":""},{"$f":"+IF(C12=\"\",\"\",TRUNC(cadastro!H14,0)+B12/1000)","v":""},{"$f":"+IF(C12=\"\",\"\",cadastro!I14*IF(C12=\"D\",-1,1))","v":""},{"$f":"+IF(C12=\"\",\"\",cadastro!M14*IF(C12=\"D\",-1,1))","v":""},{"$f":"+IF(C12=\"\",\"\",LOWER(cadastro!N14))","v":""},null,"","",null,"","","","","","",{"$f":"IF(P12=\"\",\"\",IF(COD_CM=0,1,LOOKUP(IF(COD_CM=4,EDATE(P12,1),P12),tabelas!AW:AW,tabelas!AY:AY)))","v":""},"","",{"$f":"+IF(P12=\"\",\"\",LOOKUP(EDATE(MAXA(VDAT_JUR1,P12),0),tabelas!CD:CD,tabelas!CJ:CJ))","v":""},"",""]
[null,10,{"$f":"+IF(cadastro!O15<>\"OK\",\"\",cadastro!P15)","v":""},{"$f":"+IF(C13=\"\",\"\",IF(cadastro!L15<>\"\",cadastro!L15,IF(C13=\"C\",\"Parcela Positiva\",\"Parcela Negativa\")))","v":""},{"$f":"+IF(C13=\"\",\"\",TRUNC(cadastro!H15,0)+B13/1000)","v":""},{"$f":"+IF(C13=\"\",\"\",cadastro!I15*IF(C13=\"D\",-1,1))","v":""},{"$f":"+IF(C13=\"\",\"\",cadastro!M15*IF(C13=\"D\",-1,1))","v":""},{"$f":"+IF(C13=\"\",\"\",LOWER(cadastro!N15))","v":""},null,"","",null,"","","","","","",{"$f":"IF(P13=\"\",\"\",IF(COD_CM=0,1,LOOKUP(IF(COD_CM=4,EDATE(P13,1),P13),tabelas!AW:AW,tabelas!AY:AY)))","v":""},"","",{"$f":"+IF(P13=\"\",\"\",LOOKUP(EDATE(MAXA(VDAT_JUR1,P13),0),tabelas!CD:CD,tabelas!CJ:CJ))","v":""},"","",null,{"$f":"+CONCATENATE(\"-Atualização monetária: \",Z11,\" (a partir de cada parcela)\")","v":"-Atualização monetária: Sem correção monetária (a partir de cada parcela)"}]
[null,11,{"$f":"+IF(cadastro!O16<>\"OK\",\"\",cadastro!P16)","v":""},{"$f":"+IF(C14=\"\",\"\",IF(cadastro!L16<>\"\",cadastro!L16,IF(C14=\"C\",\"Parcela Positiva\",\"Parcela Negativa\")))","v":""},{"$f":"+IF(C14=\"\",\"\",TRUNC(cadastro!H16,0)+B14/1000)","v":""},{"$f":"+IF(C14=\"\",\"\",cadastro!I16*IF(C14=\"D\",-1,1))","v":""},{"$f":"+IF(C14=\"\",\"\",cadastro!M16*IF(C14=\"D\",-1,1))","v":""},{"$f":"+IF(C14=\"\",\"\",LOWER(cadastro!N16))","v":""},null,"","",null,"","","","","","",{"$f":"IF(P14=\"\",\"\",IF(COD_CM=0,1,LOOKUP(IF(COD_CM=4,EDATE(P14,1),P14),tabelas!AW:AW,tabelas!AY:AY)))","v":""},"","",{"$f":"+IF(P14=\"\",\"\",LOOKUP(EDATE(MAXA(VDAT_JUR1,P14),0),tabelas!CD:CD,tabelas!CJ:CJ))","v":""},"",""]
[null,12,{"$f":"+IF(cadastro!O17<>\"OK\",\"\",cadastro!P17)","v":""},{"$f":"+IF(C15=\"\",\"\",IF(cadastro!L17<>\"\",cadastro!L17,IF(C15=\"C\",\"Parcela Positiva\",\"Parcela Negativa\")))","v":""},{"$f":"+IF(C15=\"\",\"\",TRUNC(cadastro!H17,0)+B15/1000)","v":""},{"$f":"+IF(C15=\"\",\"\",cadastro!I17*IF(C15=\"D\",-1,1))","v":""},{"$f":"+IF(C15=\"\",\"\",cadastro!M17*IF(C15=\"D\",-1,1))","v":""},{"$f":"+IF(C15=\"\",\"\",LOWER(cadastro!N17))","v":""},null,"","",null,"","","","","","",{"$f":"IF(P15=\"\",\"\",IF(COD_CM=0,1,LOOKUP(IF(COD_CM=4,EDATE(P15,1),P15),tabelas!AW:AW,tabelas!AY:AY)))","v":""},"","",{"$f":"+IF(P15=\"\",\"\",LOOKUP(EDATE(MAXA(VDAT_JUR1,P15),0),tabelas!CD:CD,tabelas!CJ:CJ))","v":""},"","",null,{"$f":"+IF(cadastro!D7=\"\",\"\",LOOKUP(COD_JUROS,tabelas!CL:CL,tabelas!CO:CO))","v":"SELIC"}]
[null,13,{"$f":"+IF(cadastro!O18<>\"OK\",\"\",cadastro!P18)","v":""},{"$f":"+IF(C16=\"\",\"\",IF(cadastro!L18<>\"\",cadastro!L18,IF(C16=\"C\",\"Parcela Positiva\",\"Parcela Negativa\")))","v":""},{"$f":"+IF(C16=\"\",\"\",TRUNC(cadastro!H18,0)+B16/1000)","v":""},{"$f":"+IF(C16=\"\",\"\",cadastro!I18*IF(C16=\"D\",-1,1))","v":""},{"$f":"+IF(C16=\"\",\"\",cadastro!M18*IF(C16=\"D\",-1,1))","v":""},{"$f":"+IF(C16=\"\",\"\",LOWER(cadastro!N18))","v":""},null,"","",null,"","","","","","",{"$f":"IF(P16=\"\",\"\",IF(COD_CM=0,1,LOOKUP(IF(COD_CM=4,EDATE(P16,1),P16),tabelas!AW:AW,tabelas!AY:AY)))","v":""},"","",{"$f":"+IF(P16=\"\",\"\",LOOKUP(EDATE(MAXA(VDAT_JUR1,P16),0),tabelas!CD:CD,tabelas!CJ:CJ))","v":""},"",""]
[null,14,{"$f":"+IF(cadastro!O19<>\"OK\",\"\",cadastro!P19)","v":""},{"$f":"+IF(C17=\"\",\"\",IF(cadastro!L19<>\"\",cadastro!L19,IF(C17=\"C\",\"Parcela Positiva\",\"Parcela Negativa\")))","v":""},{"$f":"+IF(C17=\"\",\"\",TRUNC(cadastro!H19,0)+B17/1000)","v":""},{"$f":"+IF(C17=\"\",\"\",cadastro!I19*IF(C17=\"D\",-1,1))","v":""},{"$f":"+IF(C17=\"\",\"\",cadastro!M19*IF(C17=\"D\",-1,1))","v":""},{"$f":"+IF(C17=\"\",\"\",LOWER(cadastro!N19))","v":""},null,"","",null,"","","","","","",{"$f":"IF(P17=\"\",\"\",IF(COD_CM=0,1,LOOKUP(IF(COD_CM=4,EDATE(P17,1),P17),tabelas!AW:AW,tabelas!AY:AY)))","v":""},"","",{"$f":"+IF(P17=\"\",\"\",LOOKUP(EDATE(MAXA(VDAT_JUR1,P17),0),tabelas!CD:CD,tabelas!CJ:CJ))","v":""},"","",null,{"$f":"+IF(cadastro!T51=\"\",\" (a partir de cada parcela)\",CONCATENATE(\"(a partir de \",TEXT(cadastro!T51,\"dd/mm/aaaa\"),\")\"))","v":" (a partir de cada parcela)"}]
[null,15,{"$f":"+IF(cadastro!O20<>\"OK\",\"\",cadastro!P20)","v":""},{"$f":"+IF(C18=\"\",\"\",IF(cadastro!L20<>\"\",cadastro!L20,IF(C18=\"C\",\"Parcela Positiva\",\"Parcela Negativa\")))","v":""},{"$f":"+IF(C18=\"\",\"\",TRUNC(cadastro!H20,0)+B18/1000)","v":""},{"$f":"+IF(C18=\"\",\"\",cadastro!I20*IF(C18=\"D\",-1,1))","v":""},{"$f":"+IF(C18=\"\",\"\",cadastro!M20*IF(C18=\"D\",-1,1))","v":""},{"$f":"+IF(C18=\"\",\"\",LOWER(cadastro!N20))","v":""},null,"","",null,"","","","","","",{"$f":"IF(P18=\"\",\"\",IF(COD_CM=0,1,LOOKUP(IF(COD_CM=4,EDATE(P18,1),P18),tabelas!AW:AW,tabelas!AY:AY)))","v":""},"","",{"$f":"+IF(P18=\"\",\"\",LOOKUP(EDATE(MAXA(VDAT_JUR1,P18),0),tabelas!CD:CD,tabelas!CJ:CJ))","v":""},"",""]
[null,16,{"$f":"+IF(cadastro!O21<>\"OK\",\"\",cadastro!P21)","v":""},{"$f":"+IF(C19=\"\",\"\",IF(cadastro!L21<>\"\",cadastro!L21,IF(C19=\"C\",\"Parcela Positiva\",\"Parcela Negativa\")))","v":""},{"$f":"+IF(C19=\"\",\"\",TRUNC(cadastro!H21,0)+B19/1000)","v":""},{"$f":"+IF(C19=\"\",\"\",cadastro!I21*IF(C19=\"D\",-1,1))","v":""},{"$f":"+IF(C19=\"\",\"\",cadastro!M21*IF(C19=\"D\",-1,1))","v":""},{"$f":"+IF(C19=\"\",\"\",LOWER(cadastro!N21))","v":""},null,"","",null,"","","","","","",{"$f":"IF(P19=\"\",\"\",IF(COD_CM=0,1,LOOKUP(IF(COD_CM=4,EDATE(P19,1),P19),tabelas!AW:AW,tabelas!AY:AY)))","v":""},"","",{"$f":"+IF(P19=\"\",\"\",LOOKUP(EDATE(MAXA(VDAT_JUR1,P19),0),tabelas!CD:CD,tabelas!CJ:CJ))","v":""},"","",null,{"$f":"+CONCATENATE(\"-Juros moratórios aplicados de forma simples: \",Z15,\" \",Z17)","v":"-Juros moratórios aplicados de forma simples: SELIC  (a partir de cada parcela)"}]
[null,17,{"$f":"+IF(cadastro!O22<>\"OK\",\"\",cadastro!P22)","v":""},{"$f":"+IF(C20=\"\",\"\",IF(cadastro!L22<>\"\",cadastro!L22,IF(C20=\"C\",\"Parcela Positiva\",\"Parcela Negativa\")))","v":""},{"$f":"+IF(C20=\"\",\"\",TRUNC(cadastro!H22,0)+B20/1000)","v":""},{"$f":"+IF(C20=\"\",\"\",cadastro!I22*IF(C20=\"D\",-1,1))","v":""},{"$f":"+IF(C20=\"\",\"\",cadastro!M22*IF(C20=\"D\",-1,1))","v":""},{"$f":"+IF(C20=\"\",\"\",LOWER(cadastro!N22))","v":""},null,"","",null,"","","","","","",{"$f":"IF(P20=\"\",\"\",IF(COD_CM=0,1,LOOKUP(IF(COD_CM=4,EDATE(P20,1),P20),tabelas!AW:AW,tabelas!AY:AY)))","v":""},"","",{"$f":"+IF(P20=\"\",\"\",LOOKUP(EDATE(MAXA(VDAT_JUR1,P20),0),tabelas!CD:CD,tabelas!CJ:CJ))","v":""},"",""]
[null,18,{"$f":"+IF(cadastro!O23<>\"OK\",\"\",cadastro!P23)","v":""},{"$f":"+IF(C21=\"\",\"\",IF(cadastro!L23<>\"\",cadastro!L23,IF(C21=\"C\",\"Parcela Positiva\",\"Parcela Negativa\")))","v":""},{"$f":"+IF(C21=\"\",\"\",TRUNC(cadastro!H23,0)+B21/1000)","v":""},{"$f":"+IF(C21=\"\",\"\",cadastro!I23*IF(C21=\"D\",-1,1))","v":""},{"$f":"+IF(C21=\"\",\"\",cadastro!M23*IF(C21=\"D\",-1,1))","v":""},{"$f":"+IF(C21=\"\",\"\",LOWER(cadastro!N23))","v":""},null,"","",null,"","","","","","",{"$f":"IF(P21=\"\",\"\",IF(COD_CM=0,1,LOOKUP(IF(COD_CM=4,EDATE(P21,1),P21),tabelas!AW:AW,tabelas!AY:AY)))","v":""},"","",{"$f":"+IF(P21=\"\",\"\",LOOKUP(EDATE(MAXA(VDAT_JUR1,P21),0),tabelas!CD:CD,tabelas!CJ:CJ))","v":""},"",""]
[null,19,{"$f":"+IF(cadastro!O24<>\"OK\",\"\",cadastro!P24)","v":""},{"$f":"+IF(C22=\"\",\"\",IF(cadastro!L24<>\"\",cadastro!L24,IF(C22=\"C\",\"Parcela Positiva\",\"Parcela Negativa\")))","v":""},{"$f":"+IF(C22=\"\",\"\",TRUNC(cadastro!H24,0)+B22/1000)","v":""},{"$f":"+IF(C22=\"\",\"\",cadastro!I24*IF(C22=\"D\",-1,1))","v":""},{"$f":"+IF(C22=\"\",\"\",cadastro!M24*IF(C22=\"D\",-1,1))","v":""},{"$f":"+IF(C22=\"\",\"\",LOWER(cadastro!N24))","v":""},null,"","",null,"","","","","","",{"$f":"IF(P22=\"\",\"\",IF(COD_CM=0,1,LOOKUP(IF(COD_CM=4,EDATE(P22,1),P22),tabelas!AW:AW,tabelas!AY:AY)))","v":""},"","",{"$f":"+IF(P22=\"\",\"\",LOOKUP(EDATE(MAXA(VDAT_JUR1,P22),0),tabelas!CD:CD,tabelas!CJ:CJ))","v":""},"",""]
[null,20,{"$f":"+IF(cadastro!O25<>\"OK\",\"\",cadastro!P25)","v":""},{"$f":"+IF(C23=\"\",\"\",IF(cadastro!L25<>\"\",cadastro!L25,IF(C23=\"C\",\"Parcela Positiva\",\"Parcela Negativa\")))","v":""},{"$f":"+IF(C23=\"\",\"\",TRUNC(cadastro!H25,0)+B23/1000)","v":""},{"$f":"+IF(C23=\"\",\"\",cadastro!I25*IF(C23=\"D\",-1,1))","v":""},{"$f":"+IF(C23=\"\",\"\",cadastro!M25*IF(C23=\"D\",-1,1))","v":""},{"$f":"+IF(C23=\"\",\"\",LOWER(cadastro!N25))","v":""},null,"","",null,"","","","","","",{"$f":"IF(P23=\"\",\"\",IF(COD_CM=0,1,LOOKUP(IF(COD_CM=4,EDATE(P23,1),P23),tabelas!AW:AW,tabelas!AY:AY)))","v":""},"","",{"$f":"+IF(P23=\"\",\"\",LOOKUP(EDATE(MAXA(VDAT_JUR1,P23),0),tabelas!CD:CD,tabelas!CJ:CJ))","v":""},"",""]
[null,21,{"$f":"+IF(cadastro!O26<>\"OK\",\"\",cadastro!P26)","v":""},{"$f":"+IF(C24=\"\",\"\",IF(cadastro!L26<>\"\",cadastro!L26,IF(C24=\"C\",\"Parcela Positiva\",\"Parcela Negativa\")))","v":""},{"$f":"+IF(C24=\"\",\"\",TRUNC(cadastro!H26,0)+B24/1000)","v":""},{"$f":"+IF(C24=\"\",\"\",cadastro!I26*IF(C24=\"D\",-1,1))","v":""},{"$f":"+IF(C24=\"\",\"\",cadastro!M26*IF(C24=\"D\",-1,1))","v":""},{"$f":"+IF(C24=\"\",\"\",LOWER(cadastro!N26))","v":""},null,"","",null,"","","","","","",{"$f":"IF(P24=\"\",\"\",IF(COD_CM=0,1,LOOKUP(IF(COD_CM=4,EDATE(P24,1),P24),tabelas!AW:AW,tabelas!AY:AY)))","v":""},"","",{"$f":"+IF(P24=\"\",\"\",LOOKUP(EDATE(MAXA(VDAT_JUR1,P24),0),tabelas!CD:CD,tabelas!CJ:CJ))","v":""},"",""]
[null,22,{"$f":"+IF(cadastro!O27<>\"OK\",\"\",cadastro!P27)","v":""},{"$f":"+IF(C25=\"\",\"\",IF(cadastro!L27<>\"\",cadastro!L27,IF(C25=\"C\",\"Parcela Positiva\",\"Parcela Negativa\")))","v":""},{"$f":"+IF(C25=\"\",\"\",TRUNC(cadastro!H27,0)+B25/1000)","v":""},{"$f":"+IF(C25=\"\",\"\",cadastro!I27*IF(C25=\"D\",-1,1))","v":""},{"$f":"+IF(C25=\"\",\"\",cadastro!M27*IF(C25=\"D\",-1,1))","v":""},{"$f":"+IF(C25=\"\",\"\",LOWER(cadastro!N27))","v":""},null,"","",null,"","","","","","",{"$f":"IF(P25=\"\",\"\",IF(COD_CM=0,1,LOOKUP(IF(COD_CM=4,EDATE(P25,1),P25),tabelas!AW:AW,tabelas!AY:AY)))","v":""},"","",{"$f":"+IF(P25=\"\",\"\",LOOKUP(EDATE(MAXA(VDAT_JUR1,P25),0),tabelas!CD:CD,tabelas!CJ:CJ))","v":""},"",""]
[null,23,{"$f":"+IF(cadastro!O28<>\"OK\",\"\",cadastro!P28)","v":""},{"$f":"+IF(C26=\"\",\"\",IF(cadastro!L28<>\"\",cadastro!L28,IF(C26=\"C\",\"Parcela Positiva\",\"Parcela Negativa\")))","v":""},{"$f":"+IF(C26=\"\",\"\",TRUNC(cadastro!H28,0)+B26/1000)","v":""},{"$f":"+IF(C26=\"\",\"\",cadastro!I28*IF(C26=\"D\",-1,1))","v":""},{"$f":"+IF(C26=\"\",\"\",cadastro!M28*IF(C26=\"D\",-1,1))","v":""},{"$f":"+IF(C26=\"\",\"\",LOWER(cadastro!N28))","v":""},null,"","",null,"","","","","","",{"$f":"IF(P26=\"\",\"\",IF(COD_CM=0,1,LOOKUP(IF(COD_CM=4,EDATE(P26,1),P26),tabelas!AW:AW,tabelas!AY:AY)))","v":""},"","",{"$f":"+IF(P26=\"\",\"\",LOOKUP(EDATE(MAXA(VDAT_JUR1,P26),0),tabelas!CD:CD,tabelas!CJ:CJ))","v":""},"",""]
[null,24,{"$f":"+IF(cadastro!O29<>\"OK\",\"\",cadastro!P29)","v":""},{"$f":"+IF(C27=\"\",\"\",IF(cadastro!L29<>\"\",cadastro!L29,IF(C27=\"C\",\"Parcela Positiva\",\"Parcela Negativa\")))","v":""},{"$f":"+IF(C27=\"\",\"\",TRUNC(cadastro!H29,0)+B27/1000)","v":""},{"$f":"+IF(C27=\"\",\"\",cadastro!I29*IF(C27=\"D\",-1,1))","v":""},{"$f":"+IF(C27=\"\",\"\",cadastro!M29*IF(C27=\"D\",-1,1))","v":""},{"$f":"+IF(C27=\"\",\"\",LOWER(cadastro!N29))","v":""},null,"","",null,"","","","","","",{"$f":"IF(P27=\"\",\"\",IF(COD_CM=0,1,LOOKUP(IF(COD_CM=4,EDATE(P27,1),P27),tabelas!AW:AW,tabelas!AY:AY)))","v":""},"","",{"$f":"+IF(P27=\"\",\"\",LOOKUP(EDATE(MAXA(VDAT_JUR1,P27),0),tabelas!CD:CD,tabelas!CJ:CJ))","v":""},"",""]
[null,25,{"$f":"+IF(cadastro!O30<>\"OK\",\"\",cadastro!P30)","v":""},{"$f":"+IF(C28=\"\",\"\",IF(cadastro!L30<>\"\",cadastro!L30,IF(C28=\"C\",\"Parcela Positiva\",\"Parcela Negativa\")))","v":""},{"$f":"+IF(C28=\"\",\"\",TRUNC(cadastro!H30,0)+B28/1000)","v":""},{"$f":"+IF(C28=\"\",\"\",cadastro!I30*IF(C28=\"D\",-1,1))","v":""},{"$f":"+IF(C28=\"\",\"\",cadastro!M30*IF(C28=\"D\",-1,1))","v":""},{"$f":"+IF(C28=\"\",\"\",LOWER(cadastro!N30))","v":""},null,"","",null,"","","","","","",{"$f":"IF(P28=\"\",\"\",IF(COD_CM=0,1,LOOKUP(IF(COD_CM=4,EDATE(P28,1),P28),tabelas!AW:AW,tabelas!AY:AY)))","v":""},"","",{"$f":"+IF(P28=\"\",\"\",LOOKUP(EDATE(MAXA(VDAT_JUR1,P28),0),tabelas!CD:CD,tabelas!CJ:CJ))","v":""},"",""]
[null,null,null,null,null,null,null,null,null,null,null,null,null,null,null,null,null,null,null,{"$f":"SUM(T4:T28)","v":0},{"$f":"SUM(U4:U28)","v":0},null,{"$f":"SUM(W4:W28)","v":0},{"$f":"SUM(X4:X28)","v":0}]